BDBM80312 (4Z)-2-bromanyl-6-methoxy-4-[[[3-(phenoxymethyl)-5-sulfanylidene-1H-1,2,4-triazol-4-yl]amino]methylidene]cyclohexa-2,5-dien-1-one::(4Z)-2-bromo-6-methoxy-4-[[[3-(phenoxymethyl)-5-sulfanylidene-1H-1,2,4-triazol-4-yl]amino]methylidene]-1-cyclohexa-2,5-dienone::(4Z)-2-bromo-6-methoxy-4-[[[3-(phenoxymethyl)-5-sulfanylidene-1H-1,2,4-triazol-4-yl]amino]methylidene]cyclohexa-2,5-dien-1-one::(4Z)-2-bromo-6-methoxy-4-[[[3-(phenoxymethyl)-5-thioxo-1H-1,2,4-triazol-4-yl]amino]methylene]cyclohexa-2,5-dien-1-one::MLS001164628::SMR000539791::cid_5736704
SMILES COc1cc(C=Nn2c(COc3ccccc3)n[nH]c2=S)cc(Br)c1O
InChI Key InChIKey=VANNOQIAVNYVHP-DJKKODMXSA-N
Data  2 IC50
  Tab Delimited (TSV)   2D SDfile   Computed 3D by Vconf -m prep SDfile
Find this compound or compounds like it in BindingDB:
Activity Spreadsheet -- Enzyme Inhibition Constant Data from BindingDB
Found 2 hits for monomerid = 80312
TargetDNA dC->dU-editing enzyme APOBEC-3A(Homo sapiens (Human))
Burnham Center For Chemical Genomics
Curated by PubChem BioAssay
LigandPNGBDBM80312((4Z)-2-bromanyl-6-methoxy-4-[[[3-(phenoxymethyl)-5...)
Affinity DataIC50: >1.00E+5nMT: 2°C. Assay description: Data Source: Sanford-Burnham Center for Chemical Genomics (SBCCG) Source Affiliation: Sanford-Burnham Medical Research Institute (SBMRI, San Diego, C...
In DepthDetails PCBioAssay
TargetDNA dC->dU-editing enzyme APOBEC-3G(Homo sapiens (Human))
Burnham Center For Chemical Genomics
Curated by PubChem BioAssay
LigandPNGBDBM80312((4Z)-2-bromanyl-6-methoxy-4-[[[3-(phenoxymethyl)-5...)
Affinity DataIC50:  2.19E+3nMT: 2°C. Assay description: Data Source: Sanford-Burnham Center for Chemical Genomics (SBCCG) Source Affiliation: Sanford-Burnham Medical Research Institute (SBMRI, San Diego, C...
In DepthDetails PCBioAssay