BDBM80345 4-(2-methylpropyl)-3-(3-morpholin-4-ylsulfonylphenyl)-1H-1,2,4-triazole-5-thione::4-(2-methylpropyl)-3-[3-(4-morpholinylsulfonyl)phenyl]-1H-1,2,4-triazole-5-thione::4-isobutyl-3-(3-morpholinosulfonylphenyl)-1H-1,2,4-triazole-5-thione::MLS002252390::SMR001314737::cid_2375957
SMILES CC(C)Cn1c(n[nH]c1=S)-c1cccc(c1)S(=O)(=O)N1CCOCC1
InChI Key InChIKey=MZTUDDKHXSNMNQ-UHFFFAOYSA-N
Data  2 IC50
  Tab Delimited (TSV)   2D SDfile   Computed 3D by Vconf -m prep SDfile
Find this compound or compounds like it in BindingDB:
Activity Spreadsheet -- Enzyme Inhibition Constant Data from BindingDB
Found 2 hits for monomerid = 80345
TargetDNA dC->dU-editing enzyme APOBEC-3A(Homo sapiens (Human))
Burnham Center For Chemical Genomics
Curated by PubChem BioAssay
LigandPNGBDBM80345(4-(2-methylpropyl)-3-(3-morpholin-4-ylsulfonylphen...)
Affinity DataIC50: >1.00E+5nMT: 2°C. Assay description: Data Source: Sanford-Burnham Center for Chemical Genomics (SBCCG) Source Affiliation: Sanford-Burnham Medical Research Institute (SBMRI, San Diego, C...
In DepthDetails PCBioAssay
TargetDNA dC->dU-editing enzyme APOBEC-3G(Homo sapiens (Human))
Burnham Center For Chemical Genomics
Curated by PubChem BioAssay
LigandPNGBDBM80345(4-(2-methylpropyl)-3-(3-morpholin-4-ylsulfonylphen...)
Affinity DataIC50:  5.37E+3nMT: 2°C. Assay description: Data Source: Sanford-Burnham Center for Chemical Genomics (SBCCG) Source Affiliation: Sanford-Burnham Medical Research Institute (SBMRI, San Diego, C...
In DepthDetails PCBioAssay