BDBM80521 3-Hydroxy-2-naphtho-p-phenetidide::3-hydroxy-N-p-phenetyl-2-naphthamide::MLS000736677::N-(4-ethoxyphenyl)-3-hydroxy-2-naphthalenecarboxamide::N-(4-ethoxyphenyl)-3-hydroxynaphthalene-2-carboxamide::N-(4-ethoxyphenyl)-3-oxidanyl-naphthalene-2-carboxamide::SMR000528245::cid_78443
SMILES CCOc1ccc(NC(=O)c2cc3ccccc3cc2O)cc1
InChI Key InChIKey=FYJKEJZGNQVNLC-UHFFFAOYSA-N
Data  2 IC50  1 EC50
  Tab Delimited (TSV)   2D SDfile   Computed 3D by Vconf -m prep SDfile
Find this compound or compounds like it in BindingDB:
Activity Spreadsheet -- Enzyme Inhibition Constant Data from BindingDB
Found 3 hits for monomerid = 80521
TargetMajor prion protein(Ovis aries)
University Of California
Curated by ChEMBL
LigandPNGBDBM80521(3-Hydroxy-2-naphtho-p-phenetidide | 3-hydroxy-N-p-...)
Affinity DataEC50:  212nM. Assay description: Antiprion activity against sheep prion infected in mouse ScN2a-cl3 cells assessed as reduction in PrPSc level after 5 days by ELISA
In DepthDetails ArticlePubMed
TargetDNA dC->dU-editing enzyme APOBEC-3G(Homo sapiens (Human))
Burnham Center For Chemical Genomics
Curated by PubChem BioAssay
LigandPNGBDBM80521(3-Hydroxy-2-naphtho-p-phenetidide | 3-hydroxy-N-p-...)
Affinity DataIC50:  4.75E+4nMT: 2°C. Assay description: Data Source: Sanford-Burnham Center for Chemical Genomics (SBCCG) Source Affiliation: Sanford-Burnham Medical Research Institute (SBMRI, San Diego, C...
In DepthDetails PCBioAssay
TargetDNA dC->dU-editing enzyme APOBEC-3A(Homo sapiens (Human))
Burnham Center For Chemical Genomics
Curated by PubChem BioAssay
LigandPNGBDBM80521(3-Hydroxy-2-naphtho-p-phenetidide | 3-hydroxy-N-p-...)
Affinity DataIC50:  1.29E+4nMT: 2°C. Assay description: Data Source: Sanford-Burnham Center for Chemical Genomics (SBCCG) Source Affiliation: Sanford-Burnham Medical Research Institute (SBMRI, San Diego, C...
In DepthDetails PCBioAssay