BDBM80639 1-[4-(4-chlorophenyl)sulfonyl-1-piperazinyl]-4-(4-ethoxyphenoxy)-1-butanone::1-[4-(4-chlorophenyl)sulfonylpiperazin-1-yl]-4-(4-ethoxyphenoxy)butan-1-one::1-[4-(4-chlorophenyl)sulfonylpiperazino]-4-(4-ethoxyphenoxy)butan-1-one::MLS001159634::SMR000707584::cid_24983035
SMILES CCOc1ccc(OCCCC(=O)N2CCN(CC2)S(=O)(=O)c2ccc(Cl)cc2)cc1
InChI Key InChIKey=JMJBHRZTTKDFNX-UHFFFAOYSA-N
Data  3 IC50
  Tab Delimited (TSV)   2D SDfile   Computed 3D by Vconf -m prep SDfile
Find this compound or compounds like it in BindingDB:
Activity Spreadsheet -- Enzyme Inhibition Constant Data from BindingDB
Found 3 hits for monomerid = 80639
TargetDNA dC->dU-editing enzyme APOBEC-3A(Homo sapiens (Human))
Burnham Center For Chemical Genomics
Curated by PubChem BioAssay
LigandPNGBDBM80639(1-[4-(4-chlorophenyl)sulfonyl-1-piperazinyl]-4-(4-...)
Affinity DataIC50:  2.04E+3nMT: 2°C. Assay description: Data Source: Sanford-Burnham Center for Chemical Genomics (SBCCG) Source Affiliation: Sanford-Burnham Medical Research Institute (SBMRI, San Diego, C...
Ligand InfoPC cidPC sid
In DepthDetails PCBioAssay
TargetCarboxy-terminal domain RNA polymerase II polypeptide A small phosphatase 1(Homo sapiens (Human))
Burnham Center For Chemical Genomics
Curated by PubChem BioAssay
LigandPNGBDBM80639(1-[4-(4-chlorophenyl)sulfonyl-1-piperazinyl]-4-(4-...)
Affinity DataIC50:  6.60E+3nM. Assay description: Data Source: Sanford-Burnham Center for Chemical Genomics (SBCCG) Source Affiliation: Sanford-Burnham Medical Research Institute (SBMRI, San Diego, C...
Ligand InfoPC cidPC sid
In DepthDetails PCBioAssay
TargetDNA dC->dU-editing enzyme APOBEC-3G(Homo sapiens (Human))
Burnham Center For Chemical Genomics
Curated by PubChem BioAssay
LigandPNGBDBM80639(1-[4-(4-chlorophenyl)sulfonyl-1-piperazinyl]-4-(4-...)
Affinity DataIC50:  2.23E+3nMT: 2°C. Assay description: Data Source: Sanford-Burnham Center for Chemical Genomics (SBCCG) Source Affiliation: Sanford-Burnham Medical Research Institute (SBMRI, San Diego, C...
Ligand InfoPC cidPC sid
In DepthDetails PCBioAssay