BDBM80807 3,5-dichlorobenzoic acid [2-(2,2-dimethyl-3-oxo-4H-quinoxalin-1-yl)-2-oxoethyl] ester::3,5-dichlorobenzoic acid [2-keto-2-(3-keto-2,2-dimethyl-4H-quinoxalin-1-yl)ethyl] ester::MLS002245978::SMR001309606::[2-(2,2-dimethyl-3-oxidanylidene-4H-quinoxalin-1-yl)-2-oxidanylidene-ethyl] 3,5-bis(chloranyl)benzoate::[2-(2,2-dimethyl-3-oxo-4H-quinoxalin-1-yl)-2-oxoethyl] 3,5-dichlorobenzoate::cid_4787553
SMILES CC1(C)N(C(=O)COC(=O)c2cc(Cl)cc(Cl)c2)c2ccccc2NC1=O
InChI Key InChIKey=XHAKQYGASGVARV-UHFFFAOYSA-N
Data  2 EC50
  Tab Delimited (TSV)   2D SDfile   Computed 3D by Vconf -m prep SDfile
Find this compound or compounds like it in BindingDB:
Activity Spreadsheet -- Enzyme Inhibition Constant Data from BindingDB
Found 2 hits for monomerid = 80807
TargetHexokinase-1(Homo sapiens (Human))
Burnham Center For Chemical Genomics
Curated by PubChem BioAssay
LigandPNGBDBM80807(3,5-dichlorobenzoic acid [2-(2,2-dimethyl-3-oxo-4H...)
Affinity DataEC50:  6.52E+4nM. Assay description: Data Source: Sanford-Burnham Center for Chemical Genomics (SBCCG) Source Affiliation: Sanford-Burnham Medical Research Institute (SBMRI, San Diego, C...
In DepthDetails PCBioAssay
TargetHexokinase HKDC1 [W721R](Homo sapiens (Human))
Burnham Center For Chemical Genomics
Curated by PubChem BioAssay
LigandPNGBDBM80807(3,5-dichlorobenzoic acid [2-(2,2-dimethyl-3-oxo-4H...)
Affinity DataEC50:  4.91E+4nM. Assay description: Data Source: Sanford-Burnham Center for Chemical Genomics (SBCCG) Source Affiliation: Sanford-Burnham Medical Research Institute (SBMRI, San Diego, C...
In DepthDetails PCBioAssay