BDBM80867 (4Z)-4-[[5-(3-chlorophenyl)-2-furanyl]methylidene]-2-thiophen-2-yl-5-oxazolone::(4Z)-4-[[5-(3-chlorophenyl)-2-furyl]methylene]-2-(2-thienyl)-2-oxazolin-5-one::(4Z)-4-[[5-(3-chlorophenyl)furan-2-yl]methylidene]-2-thiophen-2-yl-1,3-oxazol-5-one::4-{[5-(3-chlorophenyl)-2-furyl]methylene}-2-(2-thienyl)-1,3-oxazol-5(4H)-one::MLS000571650::SMR000193535::cid_1354036
SMILES Clc1cccc(c1)-c1ccc(\C=C2/N=C(OC2=O)c2cccs2)o1
InChI Key InChIKey=CUDPVTDJIKMCQP-UVTDQMKNSA-N
Data  3 IC50
  Tab Delimited (TSV)   2D SDfile   Computed 3D by Vconf -m prep SDfile
Find this compound or compounds like it in BindingDB:
Activity Spreadsheet -- Enzyme Inhibition Constant Data from BindingDB
Found 3 hits for monomerid = 80867
TargetCysteine protease ATG4B(Homo sapiens (Human))
Burnham Center For Chemical Genomics
Curated by PubChem BioAssay
LigandPNGBDBM80867((4Z)-4-[[5-(3-chlorophenyl)-2-furanyl]methylidene]...)
Affinity DataIC50:  1.48E+4nM. Assay description: Data Source: Sanford-Burnham Center for Chemical Genomics (SBCCG) Source Affiliation: Sanford-Burnham Medical Research Institute (SBMRI, San Diego, C...
In DepthDetails PCBioAssay
TargetHuntingtin(Homo sapiens (Human))
The Scripps Research Institute Molecular Screening Center
Curated by PubChem BioAssay
LigandPNGBDBM80867((4Z)-4-[[5-(3-chlorophenyl)-2-furanyl]methylidene]...)
Affinity DataIC50:  1.77E+4nM
In DepthDetails PCBioAssay
TargetPhospholipase A2(Homo sapiens (Human))
Burnham Center For Chemical Genomics
Curated by PubChem BioAssay
LigandPNGBDBM80867((4Z)-4-[[5-(3-chlorophenyl)-2-furanyl]methylidene]...)
Affinity DataIC50:  605nM. Assay description: Data Source: Sanford-Burnham Center for Chemical Genomics (SBCCG) Source Affiliation: Sanford-Burnham Medical Research Institute (SBMRI, San Diego, C...
In DepthDetails PCBioAssay