BDBM80987 2-chloranyl-3-(4-methylpiperazin-1-yl)naphthalene-1,4-dione::2-chloro-3-(4-methyl-1-piperazinyl)naphthalene-1,4-dione::2-chloro-3-(4-methylpiperazin-1-yl)naphthalene-1,4-dione::2-chloro-3-(4-methylpiperazino)-1,4-naphthoquinone::MLS002608219::SMR001526970::cid_237102
SMILES CN1CCN(CC1)C1=C(Cl)C(=O)c2ccccc2C1=O
InChI Key InChIKey=GUNUJEHGUYLPRR-UHFFFAOYSA-N
Data  4 IC50
  Tab Delimited (TSV)   2D SDfile   Computed 3D by Vconf -m prep SDfile
Find this compound or compounds like it in BindingDB:
Activity Spreadsheet -- Enzyme Inhibition Constant Data from BindingDB
Found 4 hits for monomerid = 80987
TargetCysteine protease ATG4B(Homo sapiens (Human))
Burnham Center For Chemical Genomics
Curated by PubChem BioAssay
LigandPNGBDBM80987(2-chloranyl-3-(4-methylpiperazin-1-yl)naphthalene-...)
Affinity DataIC50:  2.02E+3nM. Assay description: Data Source: Sanford-Burnham Center for Chemical Genomics (SBCCG) Source Affiliation: Sanford-Burnham Medical Research Institute (SBMRI, San Diego, C...
In DepthDetails PCBioAssay
TargetCystathionine gamma-lyase(Homo sapiens (Human))
Shanghai Jiao Tong University
Curated by ChEMBL
LigandPNGBDBM80987(2-chloranyl-3-(4-methylpiperazin-1-yl)naphthalene-...)
Affinity DataIC50: <5.00E+4nM. Assay description: Inhibition of human CSE using L-Cys as the substrate by tandem well based HTS assay
In DepthDetails ArticlePubMed
TargetTyrosyl-DNA phosphodiesterase 2(Homo sapiens (Human))
The Scripps Research Institute Molecular Screening Center
Curated by PubChem BioAssay
LigandPNGBDBM80987(2-chloranyl-3-(4-methylpiperazin-1-yl)naphthalene-...)
Affinity DataIC50:  581nM. Assay description: Source (MLPCN Center Name): The Scripps Research Institute Molecular Screening Center (SRIMSC) Center Affiliation: The Scripps Research Institute (TS...
In DepthDetails PCBioAssay
TargetPhospholipase A2(Homo sapiens (Human))
Burnham Center For Chemical Genomics
Curated by PubChem BioAssay
LigandPNGBDBM80987(2-chloranyl-3-(4-methylpiperazin-1-yl)naphthalene-...)
Affinity DataIC50:  5.89E+4nM. Assay description: Data Source: Sanford-Burnham Center for Chemical Genomics (SBCCG) Source Affiliation: Sanford-Burnham Medical Research Institute (SBMRI, San Diego, C...
In DepthDetails PCBioAssay