BDBM81052 2-[[5-[(3-nitrobenzoyl)amino]-1,3,4-thiadiazol-2-yl]thio]acetic acid ethyl ester::2-[[5-[[(3-nitrophenyl)-oxomethyl]amino]-1,3,4-thiadiazol-2-yl]thio]acetic acid ethyl ester::MLS000722359::SMR000235983::cid_5203156::ethyl 2-[[5-[(3-nitrobenzoyl)amino]-1,3,4-thiadiazol-2-yl]sulfanyl]acetate::ethyl 2-[[5-[(3-nitrophenyl)carbonylamino]-1,3,4-thiadiazol-2-yl]sulfanyl]ethanoate
SMILES CCOC(=O)CSc1nnc(NC(=O)c2cccc(c2)[N+]([O-])=O)s1
InChI Key InChIKey=WBRDCFRCAWSNKK-UHFFFAOYSA-N
Data  4 IC50
  Tab Delimited (TSV)   2D SDfile   Computed 3D by Vconf -m prep SDfile
Find this compound or compounds like it in BindingDB:
Activity Spreadsheet -- Enzyme Inhibition Constant Data from BindingDB
Found 4 hits for monomerid = 81052
TargetGlucose-6-phosphate 1-dehydrogenase(Homo sapiens (Human))
Burnham Center For Chemical Genomics
Curated by PubChem BioAssay
LigandPNGBDBM81052(2-[[5-[(3-nitrobenzoyl)amino]-1,3,4-thiadiazol-2-y...)
Affinity DataIC50:  4.38E+4nM. Assay description: Data Source: Sanford-Burnham Center for Chemical Genomics (SBCCG) Source Affiliation: Sanford-Burnham Medical Research Institute (SBMRI, San Diego CA...
In DepthDetails PCBioAssay
TargetGlucose-6-phosphate dehydrogenase-6-phosphogluconolactonase(Plasmodium falciparum 3D7)
Burnham Center For Chemical Genomics
Curated by PubChem BioAssay
LigandPNGBDBM81052(2-[[5-[(3-nitrobenzoyl)amino]-1,3,4-thiadiazol-2-y...)
Affinity DataIC50: >8.00E+4nM. Assay description: Data Source: Sanford-Burnham Center for Chemical Genomics (SBCCG) Source Affiliation: Sanford-Burnham Medical Research Institute (SBMRI, San Diego CA...
In DepthDetails PCBioAssay
TargetGlucose-6-phosphate dehydrogenase-6-phosphogluconolactonase(Plasmodium falciparum 3D7)
Burnham Center For Chemical Genomics
Curated by PubChem BioAssay
LigandPNGBDBM81052(2-[[5-[(3-nitrobenzoyl)amino]-1,3,4-thiadiazol-2-y...)
Affinity DataIC50: >8.00E+4nM. Assay description: Data Source: Sanford-Burnham Center for Chemical Genomics (SBCCG) Source Affiliation: Sanford-Burnham Medical Research Institute (SBMRI, San Diego CA...
In DepthDetails PCBioAssay
TargetGlucose-6-phosphate dehydrogenase-6-phosphogluconolactonase(Plasmodium falciparum 3D7)
Burnham Center For Chemical Genomics
Curated by PubChem BioAssay
LigandPNGBDBM81052(2-[[5-[(3-nitrobenzoyl)amino]-1,3,4-thiadiazol-2-y...)
Affinity DataIC50:  6.49E+3nM. Assay description: Data Source: Sanford-Burnham Center for Chemical Genomics (SBCCG) Source Affiliation: Sanford-Burnham Medical Research Institute (SBMRI, San Diego CA...
In DepthDetails PCBioAssay