BDBM81089 2-[[1-oxo-2-[[oxo(thiophen-2-yl)methyl]amino]ethyl]amino]acetic acid [2-(4-nitrophenyl)-2-oxoethyl] ester::2-[[2-(2-thenoylamino)acetyl]amino]acetic acid [2-keto-2-(4-nitrophenyl)ethyl] ester::MLS000711012::SMR000280779::[2-(4-nitrophenyl)-2-oxidanylidene-ethyl] 2-[2-(thiophen-2-ylcarbonylamino)ethanoylamino]ethanoate::[2-(4-nitrophenyl)-2-oxoethyl] 2-[[2-(thiophene-2-carbonylamino)acetyl]amino]acetate::cid_3116657
SMILES [O-][N+](=O)c1ccc(cc1)C(=O)COC(=O)CNC(=O)CNC(=O)c1cccs1
InChI Key InChIKey=STURDXXSYDGEOK-UHFFFAOYSA-N
Data  4 IC50
  Tab Delimited (TSV)   2D SDfile   Computed 3D by Vconf -m prep SDfile
Find this compound or compounds like it in BindingDB:
Activity Spreadsheet -- Enzyme Inhibition Constant Data from BindingDB
Found 4 hits for monomerid = 81089
TargetGlucose-6-phosphate dehydrogenase-6-phosphogluconolactonase(Plasmodium falciparum 3D7)
Burnham Center For Chemical Genomics
Curated by PubChem BioAssay
LigandPNGBDBM81089(2-[[1-oxo-2-[[oxo(thiophen-2-yl)methyl]amino]ethyl...)
Affinity DataIC50:  1.67E+4nM. Assay description: Data Source: Sanford-Burnham Center for Chemical Genomics (SBCCG) Source Affiliation: Sanford-Burnham Medical Research Institute (SBMRI, San Diego CA...
In DepthDetails PCBioAssay
TargetGlucose-6-phosphate dehydrogenase-6-phosphogluconolactonase(Plasmodium falciparum 3D7)
Burnham Center For Chemical Genomics
Curated by PubChem BioAssay
LigandPNGBDBM81089(2-[[1-oxo-2-[[oxo(thiophen-2-yl)methyl]amino]ethyl...)
Affinity DataIC50:  6.29E+4nM. Assay description: Data Source: Sanford-Burnham Center for Chemical Genomics (SBCCG) Source Affiliation: Sanford-Burnham Medical Research Institute (SBMRI, San Diego CA...
In DepthDetails PCBioAssay
TargetGlucose-6-phosphate dehydrogenase-6-phosphogluconolactonase(Plasmodium falciparum 3D7)
Burnham Center For Chemical Genomics
Curated by PubChem BioAssay
LigandPNGBDBM81089(2-[[1-oxo-2-[[oxo(thiophen-2-yl)methyl]amino]ethyl...)
Affinity DataIC50:  6.79E+4nM. Assay description: Data Source: Sanford-Burnham Center for Chemical Genomics (SBCCG) Source Affiliation: Sanford-Burnham Medical Research Institute (SBMRI, San Diego CA...
In DepthDetails PCBioAssay
TargetGlucose-6-phosphate 1-dehydrogenase(Homo sapiens (Human))
Burnham Center For Chemical Genomics
Curated by PubChem BioAssay
LigandPNGBDBM81089(2-[[1-oxo-2-[[oxo(thiophen-2-yl)methyl]amino]ethyl...)
Affinity DataIC50: >8.00E+4nM. Assay description: Data Source: Sanford-Burnham Center for Chemical Genomics (SBCCG) Source Affiliation: Sanford-Burnham Medical Research Institute (SBMRI, San Diego CA...
In DepthDetails PCBioAssay