BDBM81287 6-(6-aminopurin-9-yl)-2-ethoxy-2-oxidanylidene-4a,6,7,7a-tetrahydro-4H-furo[3,2-d][1,3,2]dioxaphosphinin-7-ol::6-(6-aminopurin-9-yl)-2-ethoxy-2-oxo-4a,6,7,7a-tetrahydro-4H-furo[3,2-d][1,3,2]dioxaphosphinin-7-ol::6-(6-aminopurin-9-yl)-2-ethoxy-2-oxo-4a,6,7,7a-tetrahydro-4H-furo[3,2-d][1,3,2]dioxaphosphorin-7-ol::6-adenin-9-yl-2-ethoxy-2-keto-4a,6,7,7a-tetrahydro-4H-furo[3,2-d][1,3,2]dioxaphosphorin-7-ol::MLS000766286::SMR000450983::cid_4132952
SMILES CCOP1(=O)OCC2OC(C(O)C2O1)n1cnc2c(N)ncnc12
InChI Key InChIKey=TXRXEHHGCBJORG-UHFFFAOYSA-N
Data  4 EC50
  Tab Delimited (TSV)   2D SDfile   Computed 3D by Vconf -m prep SDfile
Find this compound or compounds like it in BindingDB:
Activity Spreadsheet -- Enzyme Inhibition Constant Data from BindingDB
Found 4 hits for monomerid = 81287
TargetcAMP-dependent protein kinase type I-alpha regulatory subunit(Bos taurus)
The Scripps Research Institute Molecular Screening Center
Curated by PubChem BioAssay
LigandPNGBDBM81287(6-(6-aminopurin-9-yl)-2-ethoxy-2-oxidanylidene-4a,...)
Affinity DataEC50:  2.68E+3nM. Assay description: Source (MLPCN Center Name): The Scripps Research Institute Molecular Screening Center (SRIMSC) Affiliation: The Scripps Research Institute, TSRI Assa...
In DepthDetails PCBioAssay
TargetcAMP-dependent protein kinase type I-alpha regulatory subunit(Bos taurus)
The Scripps Research Institute Molecular Screening Center
Curated by PubChem BioAssay
LigandPNGBDBM81287(6-(6-aminopurin-9-yl)-2-ethoxy-2-oxidanylidene-4a,...)
Affinity DataEC50:  2.68E+3nM. Assay description: Source (MLPCN Center Name): The Scripps Research Institute Molecular Screening Center (SRIMSC) Affiliation: The Scripps Research Institute, TSRI Assa...
In DepthDetails PCBioAssay
TargetcAMP-dependent protein kinase type II-beta regulatory subunit(Homo sapiens (Human))
The Scripps Research Institute Molecular Screening Center
Curated by PubChem BioAssay
LigandPNGBDBM81287(6-(6-aminopurin-9-yl)-2-ethoxy-2-oxidanylidene-4a,...)
Affinity DataEC50:  3.75E+3nM. Assay description: Source (MLPCN Center Name): The Scripps Research Institute Molecular Screening Center (SRIMSC) Affiliation: The Scripps Research Institute, TSRI Assa...
In DepthDetails PCBioAssay
TargetcAMP-dependent protein kinase type II-beta regulatory subunit(Homo sapiens (Human))
The Scripps Research Institute Molecular Screening Center
Curated by PubChem BioAssay
LigandPNGBDBM81287(6-(6-aminopurin-9-yl)-2-ethoxy-2-oxidanylidene-4a,...)
Affinity DataEC50:  3.75E+3nM. Assay description: Source (MLPCN Center Name): The Scripps Research Institute Molecular Screening Center (SRIMSC) Affiliation: The Scripps Research Institute, TSRI Assa...
In DepthDetails PCBioAssay