BDBM82279 CAS_118997-30-1::PYY, human
SMILES CCC(C)[C@H](NC(=O)[C@@H]1CCCN1C(=O)[C@@H](N)Cc1ccc(O)cc1)C(=O)N[C@@H](CCCCN)C(=O)N1CCC[C@H]1C(=O)N[C@@H](CCC(O)=O)C(=O)N[C@@H](C)C(=O)N1CCC[C@H]1C(=O)NCC(=O)N[C@@H](CCC(O)=O)C(=O)N[C@@H](CC(O)=O)C(=O)N[C@@H](C)C(=O)N[C@@H](CO)C(=O)N1CCC[C@H]1C(=O)N[C@@H](CCC(O)=O)C(=O)N[C@@H](CCC(O)=O)C(=O)N[C@@H](CC(C)C)C(=O)N[C@@H](CC(N)=O)C(=O)N[C@@H](CCCN=C(N)N)C(=O)N[C@@H](Cc1ccc(O)cc1)C(=O)N[C@@H](Cc1ccc(O)cc1)C(=O)N[C@@H](C)C(=O)N[C@@H](CO)C(=O)N[C@@H](CC(C)C)C(=O)N[C@@H](CCCN=C(N)N)C(=O)N[C@@H](Cc1c[nH]cn1)C(=O)N[C@@H](Cc1ccc(O)cc1)C(=O)N[C@@H](CC(C)C)C(=O)N[C@@H](CC(N)=O)C(=O)N[C@@H](CC(C)C)C(=O)N[C@@H](C(C)C)C(=O)N[C@@H]([C@@H](C)O)C(=O)N[C@@H](CCCN=C(N)N)C(=O)N[C@@H](CCC(N)=O)C(=O)N[C@@H](CCCN=C(N)N)C(=O)N[C@@H](Cc1ccc(O)cc1)C(O)=O
InChI Key InChIKey=OBXYTMQSBGYHQD-IXEDMRLCSA-N
Data  11 KI
  Tab Delimited (TSV)   2D SDfile   Computed 3D by Vconf -m prep SDfile
Find this compound or compounds like it in BindingDB:
Activity Spreadsheet -- Enzyme Inhibition Constant Data from BindingDB
Found 11 hits for monomerid = 82279
TargetNeuropeptide Y receptor type 1(Homo sapiens (Human))
Synaptic Pharmaceutical
Curated by PDSP Ki Database
LigandPNGBDBM82279(CAS_118997-30-1 | PYY, human)
Affinity DataKi:  0.170nM
In DepthDetails ArticlePubMed
TargetNeuropeptide Y receptor type 2(Homo sapiens (Human))
Synaptic Pharmaceutical
Curated by PDSP Ki Database
LigandPNGBDBM82279(CAS_118997-30-1 | PYY, human)
Affinity DataKi:  0.170nM
In DepthDetails ArticlePubMed
TargetNeuropeptide Y receptor type 1(Homo sapiens (Human))
Synaptic Pharmaceutical
Curated by PDSP Ki Database
LigandPNGBDBM82279(CAS_118997-30-1 | PYY, human)
Affinity DataKi:  0.170nM
In DepthDetails ArticlePubMed
TargetNeuropeptide Y receptor type 1(Homo sapiens (Human))
Synaptic Pharmaceutical
Curated by PDSP Ki Database
LigandPNGBDBM82279(CAS_118997-30-1 | PYY, human)
Affinity DataKi:  0.170nM
In DepthDetails PubMed
TargetNeuropeptide Y receptor type 2(Homo sapiens (Human))
Synaptic Pharmaceutical
Curated by PDSP Ki Database
LigandPNGBDBM82279(CAS_118997-30-1 | PYY, human)
Affinity DataKi:  0.340nM
In DepthDetails PubMed
TargetNeuropeptide Y receptor type 2(Homo sapiens (Human))
Synaptic Pharmaceutical
Curated by PDSP Ki Database
LigandPNGBDBM82279(CAS_118997-30-1 | PYY, human)
Affinity DataKi:  0.600nM
In DepthDetails ArticlePubMed
TargetNeuropeptide Y receptor type 4(Homo sapiens (Human))
Synaptic Pharmaceutical
Curated by PDSP Ki Database
LigandPNGBDBM82279(CAS_118997-30-1 | PYY, human)
Affinity DataKi:  0.870nM
In DepthDetails ArticlePubMed
TargetNeuropeptide Y receptor type 2(Homo sapiens (Human))
Synaptic Pharmaceutical
Curated by PDSP Ki Database
LigandPNGBDBM82279(CAS_118997-30-1 | PYY, human)
In DepthDetails ArticlePubMed
TargetNeuropeptide Y receptor type 2(RABBIT)
Yamanouchi Pharmaceutical
Curated by PDSP Ki Database
LigandPNGBDBM82279(CAS_118997-30-1 | PYY, human)
Affinity DataKi:  2.5nM
In DepthDetails ArticlePubMed
TargetPro-neuropeptide Y(Homo sapiens (Human))
Amgen
Curated by PDSP Ki Database
LigandPNGBDBM82279(CAS_118997-30-1 | PYY, human)
Affinity DataKi:  1.00E+3nM
In DepthDetails ArticlePubMed
TargetPro-neuropeptide Y(RAT)
Amgen
Curated by PDSP Ki Database
LigandPNGBDBM82279(CAS_118997-30-1 | PYY, human)
Affinity DataKi:  1.00E+3nM
In DepthDetails ArticlePubMed