BDBM82571 MLS-0437597.0002::N-(4-methoxy-1,3-benzothiazol-2-yl)benzamide::cid_569599
SMILES COc1cccc2sc(NC(=O)c3ccccc3)nc12
InChI Key InChIKey=ZDBCPDBLXXFMOZ-UHFFFAOYSA-N
Data  1 IC50
  Tab Delimited (TSV)   2D SDfile   Computed 3D by Vconf -m prep SDfile
Find this compound or compounds like it in BindingDB:
Activity Spreadsheet -- Enzyme Inhibition Constant Data from BindingDB
Found 1 hit for monomerid = 82571
TargetDual specificity protein phosphatase 3(Homo sapiens (Human))
Burnham Center For Chemical Genomics
Curated by PubChem BioAssay
LigandPNGBDBM82571(MLS-0437597.0002 | N-(4-methoxy-1,3-benzothiazol-2...)
Affinity DataIC50: >6.60E+4nM. Assay description: Data Source: Sanford-Burnham Center for Chemical Genomics (SBCCG) Source Affiliation: Sanford-Burnham Medical Research Institute (SBMRI, San Diego, C...
In DepthDetails PCBioAssay