BDBM82580 3-[2,5-bis(oxidanylidene)pyrrolidin-1-yl]-N-(6-chloranyl-4-methyl-1,3-benzothiazol-2-yl)-N-(pyridin-3-ylmethyl)benzamide::MLS-0437610.0002::N-(6-chloro-4-methyl-1,3-benzothiazol-2-yl)-3-(2,5-dioxo-1-pyrrolidinyl)-N-(3-pyridinylmethyl)benzamide::N-(6-chloro-4-methyl-1,3-benzothiazol-2-yl)-3-(2,5-dioxopyrrolidin-1-yl)-N-(pyridin-3-ylmethyl)benzamide::N-(6-chloro-4-methyl-1,3-benzothiazol-2-yl)-N-(3-pyridylmethyl)-3-succinimido-benzamide::cid_41319462
SMILES Cc1cc(Cl)cc2sc(nc12)N(Cc1cccnc1)C(=O)c1cccc(c1)-n1c(O)ccc1O
InChI Key InChIKey=MVFOECBYOJPBPF-UHFFFAOYSA-N
Data  1 IC50
  Tab Delimited (TSV)   2D SDfile   Computed 3D by Vconf -m prep SDfile
Find this compound or compounds like it in BindingDB:
Activity Spreadsheet -- Enzyme Inhibition Constant Data from BindingDB
Found 1 hit for monomerid = 82580
TargetDual specificity protein phosphatase 3(Homo sapiens (Human))
Burnham Center For Chemical Genomics
Curated by PubChem BioAssay
LigandPNGBDBM82580(3-[2,5-bis(oxidanylidene)pyrrolidin-1-yl]-N-(6-chl...)
Affinity DataIC50:  5.82E+4nM. Assay description: Data Source: Sanford-Burnham Center for Chemical Genomics (SBCCG) Source Affiliation: Sanford-Burnham Medical Research Institute (SBMRI, San Diego, C...
Ligand InfoPC cidPC sid
In DepthDetails PCBioAssay