BDBM83245 3-(2-furyl)acrylaldehyde {4-nitrophenyl}hydrazone::MLS001180435::N-[[(E)-3-(2-furanyl)prop-2-enylidene]amino]-4-nitroaniline::N-[[(E)-3-(furan-2-yl)prop-2-enylidene]amino]-4-nitro-aniline::N-[[(E)-3-(furan-2-yl)prop-2-enylidene]amino]-4-nitroaniline::SMR000476224::[[(E)-3-(2-furyl)prop-2-enylidene]amino]-(4-nitrophenyl)amine::cid_23723178
SMILES [O-][N+](=O)c1ccc(cc1)N=NC=CCc1ccco1
InChI Key InChIKey=KNOJTSUUNJXZNO-UHFFFAOYSA-N
Data  2 IC50
  Tab Delimited (TSV)   2D SDfile   Computed 3D by Vconf -m prep SDfile
Find this compound or compounds like it in BindingDB:
Activity Spreadsheet -- Enzyme Inhibition Constant Data from BindingDB
Found 2 hits for monomerid = 83245
TargetBeta-lactamase(Pseudomonas aeruginosa)
The Scripps Research Institute Molecular Screening Center
Curated by PubChem BioAssay
LigandPNGBDBM83245(3-(2-furyl)acrylaldehyde {4-nitrophenyl}hydrazone ...)
Affinity DataIC50:  4.19E+3nM. Assay description: Source (MLPCN Center Name): The Scripps Research Institute Molecular Screening Center (SRIMSC) Affiliation: The Scripps Research Institute, TSRI Assa...
Ligand InfoPC cidPC sid
In DepthDetails PCBioAssay
TargetToll-like receptor 9(Homo sapiens (Human))
The Scripps Research Institute Molecular Screening Center
Curated by PubChem BioAssay
LigandPNGBDBM83245(3-(2-furyl)acrylaldehyde {4-nitrophenyl}hydrazone ...)
Affinity DataIC50:  5.87E+3nM. Assay description: Source (MLPCN Center Name): The Scripps Research Institute Molecular Screening Center (SRIMSC) Affiliation: The Scripps Research Institute, TSRI Assa...
Ligand InfoPC cidPC sid
In DepthDetails PCBioAssay