BDBM83301 4-(cyclohexylamino)-3-(4-morpholinylsulfonyl)-N-phenylbenzamide::4-(cyclohexylamino)-3-morpholin-4-ylsulfonyl-N-phenyl-benzamide::4-(cyclohexylamino)-3-morpholin-4-ylsulfonyl-N-phenylbenzamide::4-(cyclohexylamino)-3-morpholinosulfonyl-N-phenyl-benzamide::MLS000530903::SMR000135881::cid_2953765
SMILES O=C(Nc1ccccc1)c1ccc(NC2CCCCC2)c(c1)S(=O)(=O)N1CCOCC1
InChI Key InChIKey=XBRZHHNKOHWQPI-UHFFFAOYSA-N
Data  1 EC50
  Tab Delimited (TSV)   2D SDfile   Computed 3D by Vconf -m prep SDfile
Find this compound or compounds like it in BindingDB:
Activity Spreadsheet -- Enzyme Inhibition Constant Data from BindingDB
Found 1 hit for monomerid = 83301
TargetDelta-type opioid receptor(Homo sapiens (Human))
The Scripps Research Institute Molecular Screening Center
Curated by PubChem BioAssay
LigandPNGBDBM83301(4-(cyclohexylamino)-3-(4-morpholinylsulfonyl)-N-ph...)
Affinity DataEC50: >9.25E+4nM. Assay description: Source (MLPCN Center Name): The Scripps Research Institute Molecular Screening Center (SRIMSC) Affiliation: The Scripps Research Institute, TSRI Assa...
In DepthDetails PCBioAssay