BDBM83380 2-(2-amino-3-ethyl-1-benzimidazol-1-iumyl)-N-[4-(difluoromethylthio)phenyl]acetamide;chloride::2-(2-amino-3-ethyl-benzimidazol-1-ium-1-yl)-N-[4-(difluoromethylthio)phenyl]acetamide;chloride::2-(2-amino-3-ethylbenzimidazol-1-ium-1-yl)-N-[4-(difluoromethylsulfanyl)phenyl]acetamide;chloride::2-(2-azanyl-3-ethyl-benzimidazol-1-ium-1-yl)-N-[4-[bis(fluoranyl)methylsulfanyl]phenyl]ethanamide;chloride::MLS001033583::SMR000364004::cid_16196363
SMILES CCn1c2ccccc2n(CC(=O)Nc2ccc(SC(F)F)cc2)c1=[NH2+]
InChI Key InChIKey=MEPFXOYYOORHIH-UHFFFAOYSA-O
Data  1 EC50
  Tab Delimited (TSV)   2D SDfile   Computed 3D by Vconf -m prep SDfile
Find this compound or compounds like it in BindingDB:
Activity Spreadsheet -- Enzyme Inhibition Constant Data from BindingDB
Found 1 hit for monomerid = 83380
TargetDelta-type opioid receptor(Homo sapiens (Human))
The Scripps Research Institute Molecular Screening Center
Curated by PubChem BioAssay
LigandPNGBDBM83380(2-(2-amino-3-ethyl-1-benzimidazol-1-iumyl)-N-[4-(d...)
Affinity DataEC50:  3.22E+4nM. Assay description: Source (MLPCN Center Name): The Scripps Research Institute Molecular Screening Center (SRIMSC) Affiliation: The Scripps Research Institute, TSRI Assa...
Ligand InfoPC cidPC sid
In DepthDetails PCBioAssay