BDBM83391 (1S,4aS,8aS)-7-[2-(1H-indol-3-yl)ethyl]-1-methyl-1,4a,5,6,8,8a-hexahydropyrano[3,4-c]pyridine-4-carboxylic acid methyl ester::MLS000728582::SMR000470773::cid_23641069::methyl (1S,4aS,8aS)-7-[2-(1H-indol-3-yl)ethyl]-1-methyl-1,4a,5,6,8,8a-hexahydropyrano[3,4-c]pyridine-4-carboxylate
SMILES COC(=O)C1=CO[C@@H](C)[C@@H]2CN(CCc3c[nH]c4ccccc34)CC[C@H]12
InChI Key InChIKey=NYNOIMNCLKTWCG-WBAXXEDZSA-N
Data  1 EC50
  Tab Delimited (TSV)   2D SDfile   Computed 3D by Vconf -m prep SDfile
Find this compound or compounds like it in BindingDB:
Activity Spreadsheet -- Enzyme Inhibition Constant Data from BindingDB
Found 1 hit for monomerid = 83391
TargetDelta-type opioid receptor(Homo sapiens (Human))
The Scripps Research Institute Molecular Screening Center
Curated by PubChem BioAssay
LigandPNGBDBM83391((1S,4aS,8aS)-7-[2-(1H-indol-3-yl)ethyl]-1-methyl-1...)
Affinity DataEC50: >9.24E+4nM. Assay description: Source (MLPCN Center Name): The Scripps Research Institute Molecular Screening Center (SRIMSC) Affiliation: The Scripps Research Institute, TSRI Assa...
In DepthDetails PCBioAssay