BDBM83557 6-chloranyl-2-[(E)-2-(4-methoxyphenyl)ethenyl]chromen-4-one::6-chloro-2-[(E)-2-(4-methoxyphenyl)ethenyl]-1-benzopyran-4-one::6-chloro-2-[(E)-2-(4-methoxyphenyl)ethenyl]chromen-4-one::6-chloro-2-[(E)-2-(4-methoxyphenyl)vinyl]-4H-chromen-4-one::6-chloro-2-[(E)-2-(4-methoxyphenyl)vinyl]chromone::MLS000585393::SMR000204156::cid_6181973
SMILES COc1ccc(\C=C\c2cc(=O)c3cc(Cl)ccc3o2)cc1
InChI Key InChIKey=SJBCQQFJADKYMN-XBXARRHUSA-N
Data  2 EC50
  Tab Delimited (TSV)   2D SDfile   Computed 3D by Vconf -m prep SDfile
Find this compound or compounds like it in BindingDB:
Activity Spreadsheet -- Enzyme Inhibition Constant Data from BindingDB
Found 2 hits for monomerid = 83557
TargetEndoribonuclease toxin MazF(Escherichia coli str. K-12 substr. MG1655)
Burnham Center For Chemical Genomics
Curated by PubChem BioAssay
LigandPNGBDBM83557(6-chloranyl-2-[(E)-2-(4-methoxyphenyl)ethenyl]chro...)
Affinity DataEC50:  3.80E+4nM. Assay description: Data Source: Sanford-Burnham Center for Chemical Genomics (SBCCG) Source Affiliation: Sanford-Burnham Medical Research Institute (SBMRI, San Diego, C...
Ligand InfoPC cidPC sid
In DepthDetails PCBioAssay
TargetEndoribonuclease toxin MazF(Escherichia coli str. K-12 substr. MG1655)
Burnham Center For Chemical Genomics
Curated by PubChem BioAssay
LigandPNGBDBM83557(6-chloranyl-2-[(E)-2-(4-methoxyphenyl)ethenyl]chro...)
Affinity DataEC50: >9.90E+4nM. Assay description: Data Source: Sanford-Burnham Center for Chemical Genomics (SBCCG) Source Affiliation: Sanford-Burnham Medical Research Institute (SBMRI, San Diego, C...
Ligand InfoPC cidPC sid
In DepthDetails PCBioAssay