BDBM83566 (3aS,6aS)-3-(Quinoline-2-carbonyl)-5-(3-trifluoromethyl-phenyl)-3a,6a-dihydro-1H-pyrrolo[3,4-c]pyrazole-4,6-dione::(3aS,6aS)-3-(quinoline-2-carbonyl)-5-[3-(trifluoromethyl)phenyl]-3a,6a-dihydro-1H-pyrrolo[3,4-c]pyrazole-4,6-dione::(3aS,6aS)-3-[oxo(2-quinolinyl)methyl]-5-[3-(trifluoromethyl)phenyl]-3a,6a-dihydro-1H-pyrrolo[3,4-c]pyrazole-4,6-dione::(3aS,6aS)-3-quinaldoyl-5-[3-(trifluoromethyl)phenyl]-3a,6a-dihydro-1H-pyrrolo[3,4-c]pyrazole-4,6-quinone::(3aS,6aS)-3-quinolin-2-ylcarbonyl-5-[3-(trifluoromethyl)phenyl]-3a,6a-dihydro-1H-pyrrolo[3,4-c]pyrazole-4,6-dione::MLS000589495::SMR000212847::cid_12005771
SMILES Oc1n(-c2cccc(c2)C(F)(F)F)c(=O)c2c([nH][nH]c12)C(=O)c1ccc2ccccc2n1
InChI Key InChIKey=VAQFQXYRJHKZDZ-UHFFFAOYSA-N
Data  2 EC50
  Tab Delimited (TSV)   2D SDfile   Computed 3D by Vconf -m prep SDfile
Find this compound or compounds like it in BindingDB:
Activity Spreadsheet -- Enzyme Inhibition Constant Data from BindingDB
Found 2 hits for monomerid = 83566
TargetEndoribonuclease toxin MazF(Escherichia coli str. K-12 substr. MG1655)
Burnham Center For Chemical Genomics
Curated by PubChem BioAssay
LigandPNGBDBM83566((3aS,6aS)-3-(Quinoline-2-carbonyl)-5-(3-trifluorom...)
Affinity DataEC50: >9.90E+4nM. Assay description: Data Source: Sanford-Burnham Center for Chemical Genomics (SBCCG) Source Affiliation: Sanford-Burnham Medical Research Institute (SBMRI, San Diego, C...
In DepthDetails PCBioAssay
TargetEndoribonuclease toxin MazF(Escherichia coli str. K-12 substr. MG1655)
Burnham Center For Chemical Genomics
Curated by PubChem BioAssay
LigandPNGBDBM83566((3aS,6aS)-3-(Quinoline-2-carbonyl)-5-(3-trifluorom...)
Affinity DataEC50:  4.79E+4nM. Assay description: Data Source: Sanford-Burnham Center for Chemical Genomics (SBCCG) Source Affiliation: Sanford-Burnham Medical Research Institute (SBMRI, San Diego, C...
In DepthDetails PCBioAssay