BDBM83587 (5-amino-1-methylsulfonylpyrazol-3-yl) 2-methyl-3-nitrobenzoate::(5-azanyl-1-methylsulfonyl-pyrazol-3-yl) 2-methyl-3-nitro-benzoate::2-methyl-3-nitro-benzoic acid (5-amino-1-mesyl-pyrazol-3-yl) ester::2-methyl-3-nitrobenzoic acid (5-amino-1-methylsulfonyl-3-pyrazolyl) ester::MLS000680202::SMR000324479::cid_4461783
SMILES Cc1c(cccc1[N+]([O-])=O)C(=O)Oc1cc(N)n(n1)S(C)(=O)=O
InChI Key InChIKey=YHIUZIQTRFFLOH-UHFFFAOYSA-N
Data  3 EC50
  Tab Delimited (TSV)   2D SDfile   Computed 3D by Vconf -m prep SDfile
Find this compound or compounds like it in BindingDB:
Activity Spreadsheet -- Enzyme Inhibition Constant Data from BindingDB
Found 3 hits for monomerid = 83587
TargetEndoribonuclease toxin MazF(Escherichia coli str. K-12 substr. MG1655)
Burnham Center For Chemical Genomics
Curated by PubChem BioAssay
LigandPNGBDBM83587((5-amino-1-methylsulfonylpyrazol-3-yl) 2-methyl-3-...)
Affinity DataEC50: >9.90E+4nM. Assay description: Data Source: Sanford-Burnham Center for Chemical Genomics (SBCCG) Source Affiliation: Sanford-Burnham Medical Research Institute (SBMRI, San Diego, C...
In DepthDetails PCBioAssay
TargetEndoribonuclease toxin MazF(Escherichia coli str. K-12 substr. MG1655)
Burnham Center For Chemical Genomics
Curated by PubChem BioAssay
LigandPNGBDBM83587((5-amino-1-methylsulfonylpyrazol-3-yl) 2-methyl-3-...)
Affinity DataEC50:  6.63E+3nM. Assay description: Data Source: Sanford-Burnham Center for Chemical Genomics (SBCCG) Source Affiliation: Sanford-Burnham Medical Research Institute (SBMRI, San Diego, C...
In DepthDetails PCBioAssay
TargetEndoribonuclease toxin MazF(Escherichia coli str. K-12 substr. MG1655)
Burnham Center For Chemical Genomics
Curated by PubChem BioAssay
LigandPNGBDBM83587((5-amino-1-methylsulfonylpyrazol-3-yl) 2-methyl-3-...)
Affinity DataEC50:  5.59E+3nM. Assay description: Data Source: Sanford-Burnham Center for Chemical Genomics (SBCCG) Source Affiliation: Sanford-Burnham Medical Research Institute (SBMRI, San Diego, C...
In DepthDetails PCBioAssay