BDBM83597 (5Z)-3-(2-methoxyphenyl)-5-[(1,2,5-trimethyl-3-pyrrolyl)methylidene]thiazolidine-2,4-dione::(5Z)-3-(2-methoxyphenyl)-5-[(1,2,5-trimethylpyrrol-3-yl)methylene]thiazolidine-2,4-quinone::(5Z)-3-(2-methoxyphenyl)-5-[(1,2,5-trimethylpyrrol-3-yl)methylidene]-1,3-thiazolidine-2,4-dione::3-(2-methoxyphenyl)-5-[(1,2,5-trimethyl-1H-pyrrol-3-yl)methylene]-1,3-thiazolidine-2,4-dione::MLS000677545::SMR000271707::cid_2174978
SMILES COc1ccccc1N1C(=O)S\C(=C/c2cc(C)n(C)c2C)C1=O
InChI Key InChIKey=SYEQIEUUQBIVSS-YBEGLDIGSA-N
Data  2 EC50
  Tab Delimited (TSV)   2D SDfile   Computed 3D by Vconf -m prep SDfile
Find this compound or compounds like it in BindingDB:
Activity Spreadsheet -- Enzyme Inhibition Constant Data from BindingDB
Found 2 hits for monomerid = 83597
TargetEndoribonuclease toxin MazF(Escherichia coli str. K-12 substr. MG1655)
Burnham Center For Chemical Genomics
Curated by PubChem BioAssay
LigandPNGBDBM83597((5Z)-3-(2-methoxyphenyl)-5-[(1,2,5-trimethyl-3-pyr...)
Affinity DataEC50: >9.90E+4nM. Assay description: Data Source: Sanford-Burnham Center for Chemical Genomics (SBCCG) Source Affiliation: Sanford-Burnham Medical Research Institute (SBMRI, San Diego, C...
In DepthDetails PCBioAssay
TargetEndoribonuclease toxin MazF(Escherichia coli str. K-12 substr. MG1655)
Burnham Center For Chemical Genomics
Curated by PubChem BioAssay
LigandPNGBDBM83597((5Z)-3-(2-methoxyphenyl)-5-[(1,2,5-trimethyl-3-pyr...)
Affinity DataEC50:  3.06E+4nM. Assay description: Data Source: Sanford-Burnham Center for Chemical Genomics (SBCCG) Source Affiliation: Sanford-Burnham Medical Research Institute (SBMRI, San Diego, C...
In DepthDetails PCBioAssay