BDBM83766 (2,2,4-trimethyl-1H-quinolin-6-yl) 3-(1,3-dioxoisoindol-2-yl)propanoate::(2,2,4-trimethyl-1H-quinolin-6-yl) 3-[1,3-bis(oxidanylidene)isoindol-2-yl]propanoate::3-(1,3-Dioxo-1,3-dihydro-isoindol-2-yl)-propionic acid 2,2,4-trimethyl-1,2-dihydro-quinolin-6-yl ester::3-(1,3-dioxo-2-isoindolyl)propanoic acid (2,2,4-trimethyl-1H-quinolin-6-yl) ester::3-phthalimidopropionic acid (2,2,4-trimethyl-1H-quinolin-6-yl) ester::MLS000566453::SMR000177480::cid_1349589
SMILES CC1=CC(C)(C)Nc2ccc(OC(=O)CCN3C(=O)c4ccccc4C3=O)cc12
InChI Key InChIKey=CCEMPJLPXREAQW-UHFFFAOYSA-N
Data  1 EC50
  Tab Delimited (TSV)   2D SDfile   Computed 3D by Vconf -m prep SDfile
Find this compound or compounds like it in BindingDB:
Activity Spreadsheet -- Enzyme Inhibition Constant Data from BindingDB
Found 1 hit for monomerid = 83766
TargetOrotidine 5'-phosphate decarboxylase(Aspergillus niger)
The Scripps Research Institute Molecular Screening Center
Curated by PubChem BioAssay
LigandPNGBDBM83766((2,2,4-trimethyl-1H-quinolin-6-yl) 3-(1,3-dioxoiso...)
Affinity DataEC50: >5.96E+4nM. Assay description: Source (MLPCN Center Name): The Scripps Research Institute Molecular Screening Center (SRISMC) Center Affiliation: The Scripps Research Institute, TS...
In DepthDetails PCBioAssay