BDBM83912 4-Nitro-benzoic acid N'-(3-1,2,3,4-tetrahydro-carbazol-9-yl-propionyl)-hydrazide::4-nitro-N'-[1-oxo-3-(1,2,3,4-tetrahydrocarbazol-9-yl)propyl]benzohydrazide::4-nitro-N'-[3-(1,2,3,4-tetrahydrocarbazol-9-yl)propanoyl]benzohydrazide::MLS000590906::SMR000217641::cid_3424737
SMILES [O-][N+](=O)c1ccc(cc1)C(=O)NNC(=O)CCn1c2CCCCc2c2ccccc12
InChI Key InChIKey=CCSNJERMAQFWPG-UHFFFAOYSA-N
Data  3 IC50
  Tab Delimited (TSV)   2D SDfile   Computed 3D by Vconf -m prep SDfile
Find this compound or compounds like it in BindingDB:
Activity Spreadsheet -- Enzyme Inhibition Constant Data from BindingDB
Found 3 hits for monomerid = 83912
TargetApoptotic protease-activating factor 1(Homo sapiens (Human))
Burnham Center For Chemical Genomics
Curated by PubChem BioAssay
LigandPNGBDBM83912(4-Nitro-benzoic acid N'-(3-1,2,3,4-tetrahydro-...)
Affinity DataIC50:  1.80E+3nM. Assay description: Data Source: Sanford-Burnham Center for Chemical Genomics (SBCCG) Source Affiliation: Sanford-Burnham Medical Research Institute (SBIMR, San Diego, C...
In DepthDetails PCBioAssay
TargetCaspase-9(Homo sapiens (Human))
Burnham Center For Chemical Genomics
Curated by PubChem BioAssay
LigandPNGBDBM83912(4-Nitro-benzoic acid N'-(3-1,2,3,4-tetrahydro-...)
Affinity DataIC50:  728nM. Assay description: Data Source: Sanford-Burnham Center for Chemical Genomics (SBCCG) Source Affiliation: Sanford-Burnham Medical Research Institute (SBIMR, San Diego, C...
In DepthDetails PCBioAssay
TargetApoptotic protease-activating factor 1(Homo sapiens (Human))
Burnham Center For Chemical Genomics
Curated by PubChem BioAssay
LigandPNGBDBM83912(4-Nitro-benzoic acid N'-(3-1,2,3,4-tetrahydro-...)
Affinity DataIC50: >1.00E+5nM. Assay description: Data Source: Sanford-Burnham Center for Chemical Genomics (SBCCG) Source Affiliation: Sanford-Burnham Medical Research Institute (SBIMR, San Diego, C...
In DepthDetails PCBioAssay