BDBM83985 MLS001359873::Pyronin Y::SMR001224393::[6-(dimethylamino)-3-xanthenylidene]-dimethylammonium;chloride::[6-(dimethylamino)xanthen-3-ylidene]-dimethyl-ammonium;chloride::[6-(dimethylamino)xanthen-3-ylidene]-dimethyl-azanium;chloride::[6-(dimethylamino)xanthen-3-ylidene]-dimethylazanium;chloride::cid_7085
SMILES CN(C)c1ccc2cc3ccc(cc3oc2c1)=[N+](C)C
InChI Key InChIKey=MTENKDNBVMPHAS-UHFFFAOYSA-N
Data  3 IC50
  Tab Delimited (TSV)   2D SDfile   Computed 3D by Vconf -m prep SDfile
Find this compound or compounds like it in BindingDB:
Activity Spreadsheet -- Enzyme Inhibition Constant Data from BindingDB
Found 3 hits for monomerid = 83985
TargetCaspase-9(Homo sapiens (Human))
Burnham Center For Chemical Genomics
Curated by PubChem BioAssay
LigandPNGBDBM83985(MLS001359873 | Pyronin Y | SMR001224393 | [6-(dime...)
Affinity DataIC50:  1.68E+4nM. Assay description: Data Source: Sanford-Burnham Center for Chemical Genomics (SBCCG) Source Affiliation: Sanford-Burnham Medical Research Institute (SBIMR, San Diego, C...
In DepthDetails PCBioAssay
TargetApoptotic protease-activating factor 1(Homo sapiens (Human))
Burnham Center For Chemical Genomics
Curated by PubChem BioAssay
LigandPNGBDBM83985(MLS001359873 | Pyronin Y | SMR001224393 | [6-(dime...)
Affinity DataIC50:  5.32E+4nM. Assay description: Data Source: Sanford-Burnham Center for Chemical Genomics (SBCCG) Source Affiliation: Sanford-Burnham Medical Research Institute (SBIMR, San Diego, C...
In DepthDetails PCBioAssay
TargetApoptotic protease-activating factor 1(Homo sapiens (Human))
Burnham Center For Chemical Genomics
Curated by PubChem BioAssay
LigandPNGBDBM83985(MLS001359873 | Pyronin Y | SMR001224393 | [6-(dime...)
Affinity DataIC50:  3.08E+4nM. Assay description: Data Source: Sanford-Burnham Center for Chemical Genomics (SBCCG) Source Affiliation: Sanford-Burnham Medical Research Institute (SBIMR, San Diego, C...
In DepthDetails PCBioAssay