BDBM84011 MLS000544115::N-[1-(3,4-dichlorobenzyl)-1H-pyrazol-4-yl]-4-ethoxybenzamide::N-[1-(3,4-dichlorobenzyl)pyrazol-4-yl]-4-ethoxy-benzamide::N-[1-[(3,4-dichlorophenyl)methyl]-4-pyrazolyl]-4-ethoxybenzamide::N-[1-[(3,4-dichlorophenyl)methyl]pyrazol-4-yl]-4-ethoxy-benzamide::N-[1-[(3,4-dichlorophenyl)methyl]pyrazol-4-yl]-4-ethoxybenzamide::SMR000160331::cid_1236024
SMILES CCOc1ccc(cc1)C(=O)Nc1cnn(Cc2ccc(Cl)c(Cl)c2)c1
InChI Key InChIKey=LVYLRHZFTXQJCR-UHFFFAOYSA-N
Data  2 IC50  1 EC50
  Tab Delimited (TSV)   2D SDfile   Computed 3D by Vconf -m prep SDfile
Find this compound or compounds like it in BindingDB:
Activity Spreadsheet -- Enzyme Inhibition Constant Data from BindingDB
Found 3 hits for monomerid = 84011
TargetCysteine protease ATG4B(Homo sapiens (Human))
Burnham Center For Chemical Genomics
Curated by PubChem BioAssay
LigandPNGBDBM84011(MLS000544115 | N-[1-(3,4-dichlorobenzyl)-1H-pyrazo...)
Affinity DataIC50:  6.81E+4nM. Assay description: Data Source: Sanford-Burnham Center for Chemical Genomics (SBCCG) Source Affiliation: Sanford-Burnham Medical Research Institute (SBMRI, San Diego, C...
In DepthDetails PCBioAssay
TargetCorticotropin-releasing factor-binding protein(Homo sapiens (Human))
Burnham Center For Chemical Genomics
Curated by PubChem BioAssay
LigandPNGBDBM84011(MLS000544115 | N-[1-(3,4-dichlorobenzyl)-1H-pyrazo...)
Affinity DataEC50: >5.30E+4nM. Assay description: Data Source: Sanford-Burnham Center for Chemical Genomics (SBCCG) Source Affiliation: Sanford-Burnham Medical Research Institute (SBMRI, San Diego, C...
In DepthDetails PCBioAssay
TargetPhospholipase A2(Homo sapiens (Human))
Burnham Center For Chemical Genomics
Curated by PubChem BioAssay
LigandPNGBDBM84011(MLS000544115 | N-[1-(3,4-dichlorobenzyl)-1H-pyrazo...)
Affinity DataIC50:  7.91E+4nM. Assay description: Data Source: Sanford-Burnham Center for Chemical Genomics (SBCCG) Source Affiliation: Sanford-Burnham Medical Research Institute (SBMRI, San Diego, C...
In DepthDetails PCBioAssay