BDBM84021 3-(4-fluorophenyl)-5-[(E)-2-phenylethenyl]-1,2,4-oxadiazole::3-(4-fluorophenyl)-5-[(E)-styryl]-1,2,4-oxadiazole::MLS-0437545.0002::cid_5348651
SMILES Fc1ccc(cc1)-c1noc(\C=C\c2ccccc2)n1
InChI Key InChIKey=IHOGSMOPGCAFJK-IZZDOVSWSA-N
Data  1 IC50
  Tab Delimited (TSV)   2D SDfile   Computed 3D by Vconf -m prep SDfile
Find this compound or compounds like it in BindingDB:
Activity Spreadsheet -- Enzyme Inhibition Constant Data from BindingDB
Found 1 hit for monomerid = 84021
TargetSentrin-specific protease 8(Homo sapiens (Human))
Burnham Center For Chemical Genomics
Curated by PubChem BioAssay
LigandPNGBDBM84021(3-(4-fluorophenyl)-5-[(E)-2-phenylethenyl]-1,2,4-o...)
Affinity DataIC50:  2.98E+3nM. Assay description: Data Source: Sanford-Burnham Center for Chemical Genomics (SBCCG) Source Affiliation: Sanford-Burnham Medical Research Institute (SBMRI, San Diego, C...
In DepthDetails PCBioAssay