BDBM84030 5-(2,6-difluorophenyl)-3-[(E)-2-phenylethenyl]-1,2,4-oxadiazole::5-(2,6-difluorophenyl)-3-[(E)-styryl]-1,2,4-oxadiazole::5-[2,6-bis(fluoranyl)phenyl]-3-[(E)-2-phenylethenyl]-1,2,4-oxadiazole::MLS-0454386.0001::cid_49852518
SMILES Fc1cccc(F)c1-c1nc(\C=C\c2ccccc2)no1
InChI Key InChIKey=KOKVBIJDDOHWSA-MDZDMXLPSA-N
Data  1 IC50
  Tab Delimited (TSV)   2D SDfile   Computed 3D by Vconf -m prep SDfile
Find this compound or compounds like it in BindingDB:
Activity Spreadsheet -- Enzyme Inhibition Constant Data from BindingDB
Found 1 hit for monomerid = 84030
TargetSentrin-specific protease 8(Homo sapiens (Human))
Burnham Center For Chemical Genomics
Curated by PubChem BioAssay
LigandPNGBDBM84030(5-(2,6-difluorophenyl)-3-[(E)-2-phenylethenyl]-1,2...)
Affinity DataIC50:  6.98E+3nM. Assay description: Data Source: Sanford-Burnham Center for Chemical Genomics (SBCCG) Source Affiliation: Sanford-Burnham Medical Research Institute (SBMRI, San Diego, C...
In DepthDetails PCBioAssay