BDBM84037 MLS-0454418.0001::N-(6-butyl-1,3-benzothiazol-2-yl)-4-methyl-2-thiophenecarboxamide::N-(6-butyl-1,3-benzothiazol-2-yl)-4-methyl-thiophene-2-carboxamide::N-(6-butyl-1,3-benzothiazol-2-yl)-4-methylthiophene-2-carboxamide::cid_49852532
SMILES CCCCc1ccc2nc(NC(=O)c3cc(C)cs3)sc2c1
InChI Key InChIKey=SQWILUJSHXZIGV-UHFFFAOYSA-N
Data  1 IC50
  Tab Delimited (TSV)   2D SDfile   Computed 3D by Vconf -m prep SDfile
Find this compound or compounds like it in BindingDB:
Activity Spreadsheet -- Enzyme Inhibition Constant Data from BindingDB
Found 1 hit for monomerid = 84037
TargetSentrin-specific protease 8(Homo sapiens (Human))
Burnham Center For Chemical Genomics
Curated by PubChem BioAssay
LigandPNGBDBM84037(MLS-0454418.0001 | N-(6-butyl-1,3-benzothiazol-2-y...)
Affinity DataIC50:  8.25E+3nM. Assay description: Data Source: Sanford-Burnham Center for Chemical Genomics (SBCCG) Source Affiliation: Sanford-Burnham Medical Research Institute (SBMRI, San Diego, C...
In DepthDetails PCBioAssay