BDBM84094 3-(4-chlorophenyl)-N-[6-(difluoromethylsulfanyl)-1,3-benzothiazol-2-yl]-1-phenylpyrazole-4-carboxamide::3-(4-chlorophenyl)-N-[6-(difluoromethylthio)-1,3-benzothiazol-2-yl]-1-phenyl-4-pyrazolecarboxamide::3-(4-chlorophenyl)-N-[6-(difluoromethylthio)-1,3-benzothiazol-2-yl]-1-phenyl-pyrazole-4-carboxamide::MLS-0454632.0002::N-[6-[bis(fluoranyl)methylsulfanyl]-1,3-benzothiazol-2-yl]-3-(4-chlorophenyl)-1-phenyl-pyrazole-4-carboxamide::cid_2312943
SMILES FC(F)Sc1ccc2nc(NC(=O)c3cn(nc3-c3ccc(Cl)cc3)-c3ccccc3)sc2c1
InChI Key InChIKey=LKRWPKBUJKARQO-UHFFFAOYSA-N
Data  1 IC50
  Tab Delimited (TSV)   2D SDfile   Computed 3D by Vconf -m prep SDfile
Find this compound or compounds like it in BindingDB:
Activity Spreadsheet -- Enzyme Inhibition Constant Data from BindingDB
Found 1 hit for monomerid = 84094
TargetSentrin-specific protease 8(Homo sapiens (Human))
Burnham Center For Chemical Genomics
Curated by PubChem BioAssay
LigandPNGBDBM84094(3-(4-chlorophenyl)-N-[6-(difluoromethylsulfanyl)-1...)
Affinity DataIC50: >9.90E+4nM. Assay description: Data Source: Sanford-Burnham Center for Chemical Genomics (SBCCG) Source Affiliation: Sanford-Burnham Medical Research Institute (SBMRI, San Diego, C...
In DepthDetails PCBioAssay