BDBM84096 2-bromanyl-5-methoxy-N-(6-methyl-1,3-benzothiazol-2-yl)benzamide::2-bromo-5-methoxy-N-(6-methyl-1,3-benzothiazol-2-yl)benzamide::MLS-0454634.0002::cid_2701444
SMILES COc1ccc(Br)c(c1)C(=O)Nc1nc2ccc(C)cc2s1
InChI Key InChIKey=MTKBVLGWDRZANX-UHFFFAOYSA-N
Data  1 IC50
  Tab Delimited (TSV)   2D SDfile   Computed 3D by Vconf -m prep SDfile
Find this compound or compounds like it in BindingDB:
Activity Spreadsheet -- Enzyme Inhibition Constant Data from BindingDB
Found 1 hit for monomerid = 84096
TargetSentrin-specific protease 8(Homo sapiens (Human))
Burnham Center For Chemical Genomics
Curated by PubChem BioAssay
LigandPNGBDBM84096(2-bromanyl-5-methoxy-N-(6-methyl-1,3-benzothiazol-...)
Affinity DataIC50:  1.78E+3nM. Assay description: Data Source: Sanford-Burnham Center for Chemical Genomics (SBCCG) Source Affiliation: Sanford-Burnham Medical Research Institute (SBMRI, San Diego, C...
In DepthDetails PCBioAssay