BDBM84101 4-fluoranyl-3-(methoxymethyl)-N-(6-methyl-1,3-benzothiazol-2-yl)-1-benzothiophene-2-carboxamide::4-fluoro-3-(methoxymethyl)-N-(6-methyl-1,3-benzothiazol-2-yl)-1-benzothiophene-2-carboxamide::4-fluoro-3-(methoxymethyl)-N-(6-methyl-1,3-benzothiazol-2-yl)benzothiophene-2-carboxamide::MLS-0454639.0002::cid_27667674
SMILES COCc1c(sc2cccc(F)c12)C(=O)Nc1nc2ccc(C)cc2s1
InChI Key InChIKey=SYQDAQMLOUYVSA-UHFFFAOYSA-N
Data  1 IC50
  Tab Delimited (TSV)   2D SDfile   Computed 3D by Vconf -m prep SDfile
Find this compound or compounds like it in BindingDB:
Activity Spreadsheet -- Enzyme Inhibition Constant Data from BindingDB
Found 1 hit for monomerid = 84101
TargetSentrin-specific protease 8(Homo sapiens (Human))
Burnham Center For Chemical Genomics
Curated by PubChem BioAssay
LigandPNGBDBM84101(4-fluoranyl-3-(methoxymethyl)-N-(6-methyl-1,3-benz...)
Affinity DataIC50: >9.90E+4nM. Assay description: Data Source: Sanford-Burnham Center for Chemical Genomics (SBCCG) Source Affiliation: Sanford-Burnham Medical Research Institute (SBMRI, San Diego, C...
In DepthDetails PCBioAssay