BDBM84123 1-[2-[4-[5-methoxy-2-(3-methoxyphenyl)-1-benzothiophen-3-yl]phenoxy]ethyl]piperidine::1-[2-[4-[5-methoxy-2-(3-methoxyphenyl)benzothiophen-3-yl]phenoxy]ethyl]piperidine::MLS002603240::SMR001522215::cid_44601949
SMILES COc1cccc(c1)-c1sc2ccc(OC)cc2c1-c1ccc(OCCN2CCCCC2)cc1
InChI Key InChIKey=ZSGIHZIRRPTPTD-UHFFFAOYSA-N
Data  1 EC50
  Tab Delimited (TSV)   2D SDfile   Computed 3D by Vconf -m prep SDfile
Find this compound or compounds like it in BindingDB:
Activity Spreadsheet -- Enzyme Inhibition Constant Data from BindingDB
Found 1 hit for monomerid = 84123
TargetMultidrug resistance protein CDR2(Candida albicans)
Nmmlsc
Curated by PubChem BioAssay
LigandPNGBDBM84123(1-[2-[4-[5-methoxy-2-(3-methoxyphenyl)-1-benzothio...)
Affinity DataEC50:  1.12E+4nM. Assay description: UNMCMD Assay Overview: Assay Support: 1 R03 MH087406-01A1 Project Title: Identification of broad-spectrum antifungal efflux pump inhibitors ...
In DepthDetails PCBioAssay