BDBM84172 MLS000878122::N-[2-(4-chlorophenyl)ethyl]-2-(3,4-dihydro-2H-quinolin-1-yl)acetamide::N-[2-(4-chlorophenyl)ethyl]-2-(3,4-dihydro-2H-quinolin-1-yl)ethanamide::SMR000377007::cid_2548635
SMILES Clc1ccc(CCNC(=O)CN2CCCc3ccccc23)cc1
InChI Key InChIKey=HRYZQNSLGHWWKM-UHFFFAOYSA-N
Data  1 IC50
  Tab Delimited (TSV)   2D SDfile   Computed 3D by Vconf -m prep SDfile
Find this compound or compounds like it in BindingDB:
Activity Spreadsheet -- Enzyme Inhibition Constant Data from BindingDB
Found 1 hit for monomerid = 84172
TargetPotassium voltage-gated channel subfamily KQT member 2(Rattus norvegicus)
Johns Hopkins Ion Channel Center
Curated by PubChem BioAssay
LigandPNGBDBM84172(MLS000878122 | N-[2-(4-chlorophenyl)ethyl]-2-(3,4-...)
Affinity DataIC50:  8.54E+3nM. Assay description: Source (MLPCN Center Name): Johns Hopkins Ion Channel Center (JHICC_KCNQ2_Inh_HFCP_IWS_CRC) Center Affiliation: Johns Hopkins University, School of M...
In DepthDetails PCBioAssay