BDBM84183 (4-pyrimidin-2-ylpiperazin-1-yl)-(3,6,7-trimethyl-1-benzofuran-2-yl)methanone::MLS001083263::SMR000657898::[4-(2-pyrimidinyl)-1-piperazinyl]-(3,6,7-trimethyl-2-benzofuranyl)methanone::[4-(2-pyrimidyl)piperazino]-(3,6,7-trimethylbenzofuran-2-yl)methanone::cid_24793442
SMILES Cc1c(oc2c(C)c(C)ccc12)C(=O)N1CCN(CC1)c1ncccn1
InChI Key InChIKey=MOFQFMZTYKZHHR-UHFFFAOYSA-N
Data  1 IC50
  Tab Delimited (TSV)   2D SDfile   Computed 3D by Vconf -m prep SDfile
Find this compound or compounds like it in BindingDB:
Activity Spreadsheet -- Enzyme Inhibition Constant Data from BindingDB
Found 1 hit for monomerid = 84183
TargetPotassium voltage-gated channel subfamily KQT member 2(Rattus norvegicus)
Johns Hopkins Ion Channel Center
Curated by PubChem BioAssay
LigandPNGBDBM84183((4-pyrimidin-2-ylpiperazin-1-yl)-(3,6,7-trimethyl-...)
Affinity DataIC50:  4.20E+3nM. Assay description: Source (MLPCN Center Name): Johns Hopkins Ion Channel Center (JHICC_KCNQ2_Inh_HFCP_IWS_CRC) Center Affiliation: Johns Hopkins University, School of M...
Ligand InfoPC cidPC sid
In DepthDetails PCBioAssay