BDBM84191 3-[[(4-bromobenzoyl)amino]carbamoyl]-N,N-dimethyl-4-pyrrolidin-1-ylbenzenesulfonamide::3-[[(4-bromobenzoyl)amino]carbamoyl]-N,N-dimethyl-4-pyrrolidino-benzenesulfonamide::3-[[(4-bromophenyl)carbonylamino]carbamoyl]-N,N-dimethyl-4-pyrrolidin-1-yl-benzenesulfonamide::3-[[[(4-bromophenyl)-oxomethyl]hydrazo]-oxomethyl]-N,N-dimethyl-4-(1-pyrrolidinyl)benzenesulfonamide::MLS001128909::SMR000717642::cid_24982046
SMILES CN(C)S(=O)(=O)c1ccc(N2CCCC2)c(c1)C(=O)NNC(=O)c1ccc(Br)cc1
InChI Key InChIKey=PRRXPMSCBAOMBU-UHFFFAOYSA-N
Data  1 IC50
  Tab Delimited (TSV)   2D SDfile   Computed 3D by Vconf -m prep SDfile
Find this compound or compounds like it in BindingDB:
Activity Spreadsheet -- Enzyme Inhibition Constant Data from BindingDB
Found 1 hit for monomerid = 84191
TargetPotassium voltage-gated channel subfamily KQT member 2(Rattus norvegicus)
Johns Hopkins Ion Channel Center
Curated by PubChem BioAssay
LigandPNGBDBM84191(3-[[(4-bromobenzoyl)amino]carbamoyl]-N,N-dimethyl-...)
Affinity DataIC50:  3.72E+3nM. Assay description: Source (MLPCN Center Name): Johns Hopkins Ion Channel Center (JHICC_KCNQ2_Inh_HFCP_IWS_CRC) Center Affiliation: Johns Hopkins University, School of M...
In DepthDetails PCBioAssay