BDBM84222 1-[3-ethoxy-4-[2-(2-methoxy-4-prop-2-enyl-phenoxy)ethoxy]phenyl]-N-(1,2,4-triazol-4-yl)methanimine::1-[3-ethoxy-4-[2-(2-methoxy-4-prop-2-enylphenoxy)ethoxy]phenyl]-N-(1,2,4-triazol-4-yl)methanimine::MLS000534212::N-{4-[2-(4-allyl-2-methoxyphenoxy)ethoxy]-3-ethoxybenzylidene}-4H-1,2,4-triazol-4-amine::SMR000141649::[4-[2-(4-allyl-2-methoxy-phenoxy)ethoxy]-3-ethoxy-benzylidene]-(1,2,4-triazol-4-yl)amine::cid_2895796
SMILES CCOc1cc(C=Nn2cnnc2)ccc1OCCOc1ccc(CC=C)cc1OC
InChI Key InChIKey=IKRVHLFAAZPPPA-UHFFFAOYSA-N
Data  1 EC50
  Tab Delimited (TSV)   2D SDfile   Computed 3D by Vconf -m prep SDfile
Find this compound or compounds like it in BindingDB:
Activity Spreadsheet -- Enzyme Inhibition Constant Data from BindingDB
Found 1 hit for monomerid = 84222
TargetBeta-2 adrenergic receptor(Homo sapiens (Human))
Nmmlsc
Curated by PubChem BioAssay
LigandPNGBDBM84222(1-[3-ethoxy-4-[2-(2-methoxy-4-prop-2-enyl-phenoxy)...)
Affinity DataEC50:  587nM. Assay description: University of New Mexico Assay Overview: Assay Support: R03 MH093192-01 Project Title: HTS for Non-Canonical Ligands for Beta 2 Adrenergic Receptor...
In DepthDetails PCBioAssay