BDBM84242 2-phenethyl-N-phenyl-benzamide::MLS000578811::N-phenyl-2-(2-phenylethyl)benzamide::SMR000186600::cid_1271047
SMILES O=C(Nc1ccccc1)c1ccccc1CCc1ccccc1
InChI Key InChIKey=FTIFGUNGDPVCRJ-UHFFFAOYSA-N
Data  1 EC50
  Tab Delimited (TSV)   2D SDfile   Computed 3D by Vconf -m prep SDfile
Find this compound or compounds like it in BindingDB:
Activity Spreadsheet -- Enzyme Inhibition Constant Data from BindingDB
Found 1 hit for monomerid = 84242
TargetBeta-2 adrenergic receptor(Homo sapiens (Human))
Nmmlsc
Curated by PubChem BioAssay
LigandPNGBDBM84242(2-phenethyl-N-phenyl-benzamide | MLS000578811 | N-...)
Affinity DataEC50:  1.70E+3nM. Assay description: University of New Mexico Assay Overview: Assay Support: R03 MH093192-01 Project Title: HTS for Non-Canonical Ligands for Beta 2 Adrenergic Receptor...
In DepthDetails PCBioAssay