BDBM84250 4-[3-(2-furanyl)-4-(3-nitrophenyl)-6-oxo-2,4-dihydropyrrolo[3,4-c]pyrazol-5-yl]benzoic acid ethyl ester::4-[3-(2-furyl)-6-keto-4-(3-nitrophenyl)-2,4-dihydropyrrolo[3,4-c]pyrazol-5-yl]benzoic acid ethyl ester::MLS000583190::SMR000206376::cid_12005176::ethyl 4-[3-(2-furyl)-4-(3-nitrophenyl)-6-oxo-4,6-dihydropyrrolo[3,4-c]pyrazol-5(1H)-yl]benzoate::ethyl 4-[3-(furan-2-yl)-4-(3-nitrophenyl)-6-oxidanylidene-2,4-dihydropyrrolo[3,4-c]pyrazol-5-yl]benzoate::ethyl 4-[3-(furan-2-yl)-4-(3-nitrophenyl)-6-oxo-2,4-dihydropyrrolo[3,4-c]pyrazol-5-yl]benzoate
SMILES CCOC(=O)c1ccc(cc1)N1C(c2c(n[nH]c2C1=O)-c1ccco1)c1cccc(c1)[N+]([O-])=O
InChI Key InChIKey=SNKFEHHUNLAZGK-UHFFFAOYSA-N
Data  1 EC50
  Tab Delimited (TSV)   2D SDfile   Computed 3D by Vconf -m prep SDfile
Find this compound or compounds like it in BindingDB:
Activity Spreadsheet -- Enzyme Inhibition Constant Data from BindingDB
Found 1 hit for monomerid = 84250
TargetBeta-2 adrenergic receptor(Homo sapiens (Human))
Nmmlsc
Curated by PubChem BioAssay
LigandPNGBDBM84250(4-[3-(2-furanyl)-4-(3-nitrophenyl)-6-oxo-2,4-dihyd...)
Affinity DataEC50:  571nM. Assay description: University of New Mexico Assay Overview: Assay Support: R03 MH093192-01 Project Title: HTS for Non-Canonical Ligands for Beta 2 Adrenergic Receptor...
In DepthDetails PCBioAssay