BDBM84331 MLS001083234::SMR000655325::[4-[1-[(4-fluorophenyl)methyl]piperidin-4-yl]oxyphenyl]-pyrrolidin-1-yl-methanone::[4-[1-[(4-fluorophenyl)methyl]piperidin-4-yl]oxyphenyl]-pyrrolidin-1-ylmethanone::[4-[[1-(4-fluorobenzyl)-4-piperidyl]oxy]phenyl]-pyrrolidino-methanone::[4-[[1-[(4-fluorophenyl)methyl]-4-piperidinyl]oxy]phenyl]-(1-pyrrolidinyl)methanone::cid_24817062
SMILES Fc1ccc(CN2CCC(CC2)Oc2ccc(cc2)C(=O)N2CCCC2)cc1
InChI Key InChIKey=DVXLULPKIUVRHU-UHFFFAOYSA-N
Data  1 EC50
  Tab Delimited (TSV)   2D SDfile   Computed 3D by Vconf -m prep SDfile
Find this compound or compounds like it in BindingDB:
Activity Spreadsheet -- Enzyme Inhibition Constant Data from BindingDB
Found 1 hit for monomerid = 84331
TargetBeta-2 adrenergic receptor(Homo sapiens (Human))
Nmmlsc
Curated by PubChem BioAssay
LigandPNGBDBM84331(MLS001083234 | SMR000655325 | [4-[1-[(4-fluorophen...)
Affinity DataEC50:  5.28E+3nM. Assay description: University of New Mexico Assay Overview: Assay Support: R03 MH093192-01 Project Title: HTS for Non-Canonical Ligands for Beta 2 Adrenergic Receptor...
In DepthDetails PCBioAssay