BDBM84338 MLS001167739::N-[4-(2-pyridin-3-ylpiperidin-1-yl)sulfonylphenyl]pentanamide::N-[4-[2-(3-pyridyl)piperidino]sulfonylphenyl]valeramide::N-[4-[[2-(3-pyridinyl)-1-piperidinyl]sulfonyl]phenyl]pentanamide::SMR000805801::cid_4611324
SMILES CCCCC(=O)Nc1ccc(cc1)S(=O)(=O)N1CCCCC1c1cccnc1
InChI Key InChIKey=ZAVAKSHBFXECCG-UHFFFAOYSA-N
Data  1 EC50
  Tab Delimited (TSV)   2D SDfile   Computed 3D by Vconf -m prep SDfile
Find this compound or compounds like it in BindingDB:
Activity Spreadsheet -- Enzyme Inhibition Constant Data from BindingDB
Found 1 hit for monomerid = 84338
TargetBeta-2 adrenergic receptor(Homo sapiens (Human))
Nmmlsc
Curated by PubChem BioAssay
LigandPNGBDBM84338(MLS001167739 | N-[4-(2-pyridin-3-ylpiperidin-1-yl)...)
Affinity DataEC50:  32.2nM. Assay description: University of New Mexico Assay Overview: Assay Support: R03 MH093192-01 Project Title: HTS for Non-Canonical Ligands for Beta 2 Adrenergic Receptor...
In DepthDetails PCBioAssay