BDBM84385 8-methoxy-5-methyl-3-(methylthio)-[1,2,4]triazin[5,6-b]indole::cid_649707
SMILES COc1ccc2n(C)c3nc(SC)nnc3c2c1
InChI Key InChIKey=PPFWHBXTJRKOJU-UHFFFAOYSA-N
Data  1 EC50
  Tab Delimited (TSV)   2D SDfile   Computed 3D by Vconf -m prep SDfile
Find this compound or compounds like it in BindingDB:
Activity Spreadsheet -- Enzyme Inhibition Constant Data from BindingDB
Found 1 hit for monomerid = 84385
Target60S ribosomal protein L19-A(Saccharomyces cerevisiae)
Nmmlsc
Curated by PubChem BioAssay
LigandPNGBDBM84385(8-methoxy-5-methyl-3-(methylthio)-[1,2,4]triazin[5...)
Affinity DataEC50:  681nM. Assay description: University of New Mexico Assay Overview: Assay Support: 1R03 MH086450-01 Project Title: Chemical Screen of TOR pathway GFP fusion proteins in S. ...
In DepthDetails PCBioAssay