BDBM86133 LDHA Inhibitor, 29
SMILES Cc1nc2ccc(NC(=O)CCNC(=O)NCCc3ccc(CC(C(O)=O)C(O)=O)cc3)cc2s1
InChI Key InChIKey=GADNEHRFYQNKCC-UHFFFAOYSA-N
Data  1 IC50  1 Kd
PDB links: 1 PDB ID matches this monomer.
  Tab Delimited (TSV)   2D SDfile   Computed 3D by Vconf -m prep SDfile
Find this compound or compounds like it in BindingDB:
Activity Spreadsheet -- Enzyme Inhibition Constant Data from BindingDB
Found 2 hits for monomerid = 86133
TargetL-lactate dehydrogenase A chain(Rattus norvegicus (Rat))
Astrazeneca
LigandPNGBDBM86133(LDHA Inhibitor, 29)
Affinity DataIC50:  1.90E+3nMpH: 7.5 T: 2°C. Assay description: Enzyme assay using lactate dehydrogenase A (LDHA).
TargetL-lactate dehydrogenase A chain(Rattus norvegicus (Rat))
Astrazeneca
LigandPNGBDBM86133(LDHA Inhibitor, 29)
Affinity DataKd:  69nMpH: 7.4Assay Description:A BIAcore 3000 or a BIAcore S51 instrument (GE Healthcare) was used to detect binding interactions using a direct binding assay format.