BDBM87069 (4-anilino-6-ethoxy-s-triazin-2-yl)-[4-(1,3-benzoxazol-2-yl)phenyl]amine::2-N-[4-(1,3-benzoxazol-2-yl)phenyl]-6-ethoxy-4-N-phenyl-1,3,5-triazine-2,4-diamine::MLS-0463501.0001::N2-[4-(1,3-benzoxazol-2-yl)phenyl]-6-ethoxy-N4-phenyl-1,3,5-triazine-2,4-diamine::cid_3386884
SMILES CCOc1nc(Nc2ccccc2)nc(Nc2ccc(cc2)-c2nc3ccccc3o2)n1
InChI Key InChIKey=RBFZNPVXWQNKPF-UHFFFAOYSA-N
Data  1 IC50
  Tab Delimited (TSV)   2D SDfile   Computed 3D by Vconf -m prep SDfile
Find this compound or compounds like it in BindingDB:
Activity Spreadsheet -- Enzyme Inhibition Constant Data from BindingDB
Found 1 hit for monomerid = 87069
TargetDNA dC->dU-editing enzyme APOBEC-3G(Homo sapiens (Human))
Burnham Center For Chemical Genomics
Curated by PubChem BioAssay
LigandPNGBDBM87069((4-anilino-6-ethoxy-s-triazin-2-yl)-[4-(1,3-benzox...)
Affinity DataIC50: >9.90E+4nMT: 2°C. Assay description: Data Source: Sanford-Burnham Center for Chemical Genomics (SBCCG) Source Affiliation: Sanford-Burnham Medical Research Institute (SBMRI, San Diego, C...
In DepthDetails PCBioAssay