BDBM87092 2-[2-(4-fluoranylphenoxy)ethylsulfanyl]-1H-imidazo[4,5-b]pyridine::2-[2-(4-fluorophenoxy)ethylsulfanyl]-1H-imidazo[4,5-b]pyridine::2-[2-(4-fluorophenoxy)ethylthio]-1H-imidazo[4,5-b]pyridine::MLS-0463474.0001::cid_20908773
SMILES Fc1ccc(OCCSc2nc3ncccc3[nH]2)cc1
InChI Key InChIKey=ZXOZKQGDHGINOE-UHFFFAOYSA-N
Data  1 IC50
  Tab Delimited (TSV)   2D SDfile   Computed 3D by Vconf -m prep SDfile
Find this compound or compounds like it in BindingDB:
Activity Spreadsheet -- Enzyme Inhibition Constant Data from BindingDB
Found 1 hit for monomerid = 87092
TargetDNA dC->dU-editing enzyme APOBEC-3G(Homo sapiens (Human))
Burnham Center For Chemical Genomics
Curated by PubChem BioAssay
LigandPNGBDBM87092(2-[2-(4-fluoranylphenoxy)ethylsulfanyl]-1H-imidazo...)
Affinity DataIC50: >9.90E+4nMT: 2°C. Assay description: Data Source: Sanford-Burnham Center for Chemical Genomics (SBCCG) Source Affiliation: Sanford-Burnham Medical Research Institute (SBMRI, San Diego, C...
Ligand InfoPC cidPC sid
In DepthDetails PCBioAssay