BDBM87105 1-[1-(2,5-difluorophenyl)-2,5-dimethyl-3-pyrrolyl]-2-[(5-phenyl-3-thiazolo[2,3-c][1,2,4]triazolyl)thio]ethanone::1-[1-(2,5-difluorophenyl)-2,5-dimethyl-pyrrol-3-yl]-2-[(5-phenylthiazolo[2,3-c][1,2,4]triazol-3-yl)thio]ethanone::1-[1-(2,5-difluorophenyl)-2,5-dimethylpyrrol-3-yl]-2-[(5-phenyl-[1,3]thiazolo[2,3-c][1,2,4]triazol-3-yl)sulfanyl]ethanone::1-[1-[2,5-bis(fluoranyl)phenyl]-2,5-dimethyl-pyrrol-3-yl]-2-[(5-phenyl-[1,3]thiazolo[2,3-c][1,2,4]triazol-3-yl)sulfanyl]ethanone::MLS-0463487.0001::cid_1281726
SMILES Cc1cc(C(=O)CSc2nnc3scc(-c4ccccc4)n23)c(C)n1-c1cc(F)ccc1F
InChI Key InChIKey=IOLZEQGCVCYBIR-UHFFFAOYSA-N
Data  1 IC50
  Tab Delimited (TSV)   2D SDfile   Computed 3D by Vconf -m prep SDfile
Find this compound or compounds like it in BindingDB:
Activity Spreadsheet -- Enzyme Inhibition Constant Data from BindingDB
Found 1 hit for monomerid = 87105
TargetDNA dC->dU-editing enzyme APOBEC-3G(Homo sapiens (Human))
Burnham Center For Chemical Genomics
Curated by PubChem BioAssay
LigandPNGBDBM87105(1-[1-(2,5-difluorophenyl)-2,5-dimethyl-3-pyrrolyl]...)
Affinity DataIC50: >9.90E+4nMT: 2°C. Assay description: Data Source: Sanford-Burnham Center for Chemical Genomics (SBCCG) Source Affiliation: Sanford-Burnham Medical Research Institute (SBMRI, San Diego, C...
In DepthDetails PCBioAssay