BDBM87109 2-[[5-(4-methoxyphenyl)-1H-1,2,4-triazol-3-yl]sulfanylmethyl]-1H-thieno[3,2-d]pyrimidin-4-one::2-[[[5-(4-methoxyphenyl)-1H-1,2,4-triazol-3-yl]thio]methyl]-1H-thieno[3,2-d]pyrimidin-4-one::MLS-0463491.0001::cid_7854933
SMILES COc1ccc(cc1)-c1nnc(SCc2nc3ccsc3c(=O)[nH]2)[nH]1
InChI Key InChIKey=RKQOFXMWGXHLKL-UHFFFAOYSA-N
Data  1 IC50
  Tab Delimited (TSV)   2D SDfile   Computed 3D by Vconf -m prep SDfile
Find this compound or compounds like it in BindingDB:
Activity Spreadsheet -- Enzyme Inhibition Constant Data from BindingDB
Found 1 hit for monomerid = 87109
TargetDNA dC->dU-editing enzyme APOBEC-3G(Homo sapiens (Human))
Burnham Center For Chemical Genomics
Curated by PubChem BioAssay
LigandPNGBDBM87109(2-[[5-(4-methoxyphenyl)-1H-1,2,4-triazol-3-yl]sulf...)
Affinity DataIC50:  6.64E+4nMT: 2°C. Assay description: Data Source: Sanford-Burnham Center for Chemical Genomics (SBCCG) Source Affiliation: Sanford-Burnham Medical Research Institute (SBMRI, San Diego, C...
In DepthDetails PCBioAssay