BDBM87122 N-[2-[1-(3-fluorophenyl)-4-keto-1,3,8-triazaspiro[4.5]decan-8-yl]ethyl]-1,3-diketo-phthalan-5-carboxamide;2,2,2-trifluoroacetic acid::N-[2-[1-(3-fluorophenyl)-4-oxidanylidene-1,3,8-triazaspiro[4.5]decan-8-yl]ethyl]-1,3-bis(oxidanylidene)-2-benzofuran-5-carboxamide;2,2,2-tris(fluoranyl)ethanoic acid::N-[2-[1-(3-fluorophenyl)-4-oxo-1,3,8-triazaspiro[4.5]decan-8-yl]ethyl]-1,3-dioxo-2-benzofuran-5-carboxamide;2,2,2-trifluoroacetic acid::N-[2-[1-(3-fluorophenyl)-4-oxo-1,3,8-triazaspiro[4.5]decan-8-yl]ethyl]-1,3-dioxo-5-isobenzofurancarboxamide;2,2,2-trifluoroacetic acid::VU0462229-1::cid_53393903
SMILES Fc1cccc(c1)N1CNC(=O)C11CCN(CCNC(=O)c2ccc3C(=O)OC(=O)c3c2)CC1
InChI Key InChIKey=NKUWWUJQMGSFGM-UHFFFAOYSA-N
Data  2 IC50
  Tab Delimited (TSV)   2D SDfile   Computed 3D by Vconf -m prep SDfile
Find this compound or compounds like it in BindingDB:
Activity Spreadsheet -- Enzyme Inhibition Constant Data from BindingDB
Found 2 hits for monomerid = 87122
TargetPhospholipase D1(Homo sapiens (Human))
Vanderbilt Specialized Chemistry Center
Curated by PubChem BioAssay
LigandPNGBDBM87122(N-[2-[1-(3-fluorophenyl)-4-keto-1,3,8-triazaspiro[...)
Affinity DataIC50:  5.55E+3nM. Assay description: Phospholipase D (PLD) generates the lipid second messenger phosphatidic acid as part of a plethora of cellular functions. Phosphatidic acid (PtdOH) i...
Ligand InfoPC cidPC sid
In DepthDetails PCBioAssay
TargetPhospholipase D2(Homo sapiens (Human))
Vanderbilt Specialized Chemistry Center
Curated by PubChem BioAssay
LigandPNGBDBM87122(N-[2-[1-(3-fluorophenyl)-4-keto-1,3,8-triazaspiro[...)
Affinity DataIC50:  265nM. Assay description: Phospholipase D (PLD) generates the lipid second messenger phosphatidic acid as part of a plethora of cellular functions. Phosphatidic acid (PtdOH) i...
Ligand InfoPC cidPC sid
In DepthDetails PCBioAssay