BDBM87176 4,5-bis(bromanyl)-N-[(2R)-1-(4-oxidanylidene-1-phenyl-1,3,8-triazaspiro[4.5]decan-8-yl)propan-2-yl]furan-2-carboxamide;2,2,2-tris(fluoranyl)ethanoic acid::4,5-dibromo-N-[(1R)-2-(4-keto-1-phenyl-1,3,8-triazaspiro[4.5]decan-8-yl)-1-methyl-ethyl]-2-furamide;2,2,2-trifluoroacetic acid::4,5-dibromo-N-[(2R)-1-(4-oxo-1-phenyl-1,3,8-triazaspiro[4.5]decan-8-yl)propan-2-yl]-2-furancarboxamide;2,2,2-trifluoroacetic acid::4,5-dibromo-N-[(2R)-1-(4-oxo-1-phenyl-1,3,8-triazaspiro[4.5]decan-8-yl)propan-2-yl]furan-2-carboxamide;2,2,2-trifluoroacetic acid::VU0366557-1::cid_53470036
SMILES C[C@H](CN1CCC2(CC1)N(CNC2=O)c1ccccc1)NC(=O)c1cc(Br)c(Br)o1
InChI Key InChIKey=UOLJLCJKXHYZKR-CQSZACIVSA-N
Data  2 IC50
  Tab Delimited (TSV)   2D SDfile   Computed 3D by Vconf -m prep SDfile
Find this compound or compounds like it in BindingDB:
Activity Spreadsheet -- Enzyme Inhibition Constant Data from BindingDB
Found 2 hits for monomerid = 87176
TargetPhospholipase D1(Homo sapiens (Human))
Vanderbilt Specialized Chemistry Center
Curated by PubChem BioAssay
LigandPNGBDBM87176(4,5-bis(bromanyl)-N-[(2R)-1-(4-oxidanylidene-1-phe...)
Affinity DataIC50:  330nM. Assay description: Phospholipase D (PLD) generates the lipid second messenger phosphatidic acid as part of a plethora of cellular functions. Phosphatidic acid (PtdOH) i...
In DepthDetails PCBioAssay
TargetPhospholipase D2(Homo sapiens (Human))
Vanderbilt Specialized Chemistry Center
Curated by PubChem BioAssay
LigandPNGBDBM87176(4,5-bis(bromanyl)-N-[(2R)-1-(4-oxidanylidene-1-phe...)
Affinity DataIC50:  2.30E+3nM. Assay description: Phospholipase D (PLD) generates the lipid second messenger phosphatidic acid as part of a plethora of cellular functions. Phosphatidic acid (PtdOH) i...
In DepthDetails PCBioAssay