BDBM87233 1-(3-fluorophenyl)-3-[2-[4-(2-keto-3H-benzimidazol-1-yl)piperidino]ethyl]urea::1-(3-fluorophenyl)-3-[2-[4-(2-oxidanylidene-3H-benzimidazol-1-yl)piperidin-1-yl]ethyl]urea::1-(3-fluorophenyl)-3-[2-[4-(2-oxo-3H-benzimidazol-1-yl)-1-piperidinyl]ethyl]urea::1-(3-fluorophenyl)-3-[2-[4-(2-oxo-3H-benzimidazol-1-yl)piperidin-1-yl]ethyl]urea::VU0249393-1::cid_53470262
SMILES Fc1cccc(NC(=O)NCCN2CCC(CC2)n2c3ccccc3[nH]c2=O)c1
InChI Key InChIKey=BTPWKORIVWPLDC-UHFFFAOYSA-N
Data  2 IC50
  Tab Delimited (TSV)   2D SDfile   Computed 3D by Vconf -m prep SDfile
Find this compound or compounds like it in BindingDB:
Activity Spreadsheet -- Enzyme Inhibition Constant Data from BindingDB
Found 2 hits for monomerid = 87233
TargetPhospholipase D1(Homo sapiens (Human))
Vanderbilt Specialized Chemistry Center
Curated by PubChem BioAssay
LigandPNGBDBM87233(1-(3-fluorophenyl)-3-[2-[4-(2-keto-3H-benzimidazol...)
Affinity DataIC50:  78nM. Assay description: Phospholipase D (PLD) generates the lipid second messenger phosphatidic acid as part of a plethora of cellular functions. Phosphatidic acid (PtdOH) i...
In DepthDetails PCBioAssay
TargetPhospholipase D2(Homo sapiens (Human))
Vanderbilt Specialized Chemistry Center
Curated by PubChem BioAssay
LigandPNGBDBM87233(1-(3-fluorophenyl)-3-[2-[4-(2-keto-3H-benzimidazol...)
Affinity DataIC50:  2.30E+3nM. Assay description: Phospholipase D (PLD) generates the lipid second messenger phosphatidic acid as part of a plethora of cellular functions. Phosphatidic acid (PtdOH) i...
In DepthDetails PCBioAssay