BDBM87236 N-[2-[4-(6-fluoranyl-2-oxidanylidene-3H-benzimidazol-1-yl)piperidin-1-yl]ethyl]-9-oxidanylidene-fluorene-1-carboxamide::N-[2-[4-(6-fluoro-2-keto-3H-benzimidazol-1-yl)piperidino]ethyl]-9-keto-fluorene-1-carboxamide::N-[2-[4-(6-fluoro-2-oxo-3H-benzimidazol-1-yl)-1-piperidinyl]ethyl]-9-oxo-1-fluorenecarboxamide::N-[2-[4-(6-fluoro-2-oxo-3H-benzimidazol-1-yl)piperidin-1-yl]ethyl]-9-oxofluorene-1-carboxamide::VU0249424-1::cid_53470288
SMILES Fc1ccc2[nH]c(=O)n(C3CCN(CCNC(=O)c4cccc5-c6ccccc6C(=O)c45)CC3)c2c1
InChI Key InChIKey=AREIGOLWYGBISF-UHFFFAOYSA-N
Data  2 IC50
  Tab Delimited (TSV)   2D SDfile   Computed 3D by Vconf -m prep SDfile
Find this compound or compounds like it in BindingDB:
Activity Spreadsheet -- Enzyme Inhibition Constant Data from BindingDB
Found 2 hits for monomerid = 87236
TargetPhospholipase D1(Homo sapiens (Human))
Vanderbilt Specialized Chemistry Center
Curated by PubChem BioAssay
LigandPNGBDBM87236(N-[2-[4-(6-fluoranyl-2-oxidanylidene-3H-benzimidaz...)
Affinity DataIC50:  7nM. Assay description: Phospholipase D (PLD) generates the lipid second messenger phosphatidic acid as part of a plethora of cellular functions. Phosphatidic acid (PtdOH) i...
In DepthDetails PCBioAssay
TargetPhospholipase D2(Homo sapiens (Human))
Vanderbilt Specialized Chemistry Center
Curated by PubChem BioAssay
LigandPNGBDBM87236(N-[2-[4-(6-fluoranyl-2-oxidanylidene-3H-benzimidaz...)
Affinity DataIC50:  170nM. Assay description: Phospholipase D (PLD) generates the lipid second messenger phosphatidic acid as part of a plethora of cellular functions. Phosphatidic acid (PtdOH) i...
In DepthDetails PCBioAssay